program: Gaussian 09
title: 000087440
version: EM64L-G09RevD.01
frameworkgroup: C1[X(C16H15NO4)]
method: RPBEPBE
basis: SDD
operation: Freq
keyword: #p
keyword: freq=noraman
keyword: PBEPBE/SDD
title: #p freq=noraman PBEPBE/SDD
converged: YES YES NO NO
title: Mulliken charges:
elementType: O O O O N C C C C C C C C C C C C C C C C H H H H H H H H H H H H H H H
charge: -0.289689 -0.489553 -0.291806 -0.302886 -0.509156 0.333148 0.013590 0.082675 -0.335133 0.139839 -0.306914 -0.226991 -0.252586 0.212879 0.244540 -0.293394 -0.391053 -0.258055 -0.195610 -0.220372 -0.673949 0.478563 0.323505 0.272569 0.230061 0.231514 0.283760 0.220213 0.233509 0.231280 0.226301 0.226203 0.211383 0.231016 0.231126 0.379471
chargesum: 0.00000
title: Mulliken charges with hydrogens summed into heavy atoms:
elementType: O O O O N C C C C C C C C C C C C C C C C
charge: -0.289689 -0.110083 -0.291806 -0.302886 -0.030593 0.333148 0.013590 0.082675 -0.011628 0.139839 -0.034345 0.003070 -0.021071 0.212879 0.244540 -0.009634 -0.170839 -0.024546 0.035669 0.232132 -0.000424
polarizability: 3.13790187e+02 1.58443835e+01 2.42673354e+02 -1.42606885e+00 6.95663973e-01 8.43553283e+01
1716.lowfreq: -9.3376 -6.9036 -0.0009 0.0003 0.0004 1.9155 3.0442 26.3271 32.3668
frequency: -9.2212 26.2970 32.3296 64.2920 73.5711 89.2915 113.8744 120.2303 124.6747 173.7530 182.8742 223.6967 237.8093 247.9409 296.5808 298.7934 313.6813 336.0953 375.3198 378.8103 387.8623 435.0745 438.4177 493.9689 514.5070 523.4060 540.6079 542.8593 578.4966 648.4612 664.8583 676.1596 680.5407 755.0358 762.3494 770.8460 781.2187 786.8785 799.5950 809.2413 820.3635 857.1724 858.3912 875.1104 905.2523 960.2426 980.5051 986.4808 1002.2589 1013.0124 1016.8800 1031.5593 1044.8200 1050.2987 1057.7358 1082.2191 1112.1319 1128.3713 1136.5103 1139.4378 1169.8433 1176.4100 1218.2588 1233.3472 1241.0841 1248.4273 1263.3355 1286.5290 1294.6312 1356.2975 1378.4197 1392.1235 1400.0542 1432.7689 1434.7035 1455.5661 1462.7203 1473.6943 1483.1355 1486.9142 1509.3126 1551.5922 1580.6785 1591.5409 1607.2369 1616.8595 1628.4726 2995.6598 3006.9152 3065.1523 3092.2029 3107.1450 3118.9635 3134.4619 3142.4761 3156.6481 3157.7969 3173.0833 3182.2478 3199.4821 3209.8466 3624.1103
redmass: 5.8116 3.4154 6.0300 4.6571 4.3413 2.7154 4.9729 4.5226 4.5599 4.0690 5.3009 6.3201 2.1940 1.9876 4.7949 5.4990 6.5883 1.0844 4.2752 5.9886 8.8704 3.5563 3.6899 5.9971 5.5373 3.3922 3.4189 6.7805 6.9761 6.5344 6.8895 4.2833 4.8165 2.2542 2.5896 1.9837 7.1475 1.6383 1.1277 4.9716 5.3389 1.5098 4.4726 6.2384 1.3983 1.3488 1.3663 1.1004 1.3327 1.3160 2.6849 2.8221 4.9126 2.1791 2.0101 2.6047 2.2336 1.6695 1.4628 1.4466 1.0649 1.0841 2.2916 3.6779 2.7002 1.1338 1.9509 1.5480 2.1003 1.5195 5.6562 8.9485 1.2744 2.4922 2.4949 2.5599 1.0405 1.0584 2.5593 1.0872 2.4549 8.0811 5.6288 6.0849 6.3286 6.4052 3.6614 1.0359 1.0579 1.1067 1.0985 1.1024 1.0884 1.0874 1.0889 1.0933 1.0932 1.0996 1.0960 1.0944 1.0833 1.0669
irintensity: 0.0239 0.3957 4.7865 0.0515 0.4866 4.1530 0.2335 0.7077 0.6138 1.7666 7.2534 0.8737 0.5264 0.6023 0.1079 11.8945 4.5634 128.7317 12.9566 15.0331 1.9284 0.0693 2.4548 14.7146 3.8140 30.5783 1.1708 3.6379 5.0879 9.0764 1.7324 16.2956 14.3372 35.7246 59.6848 33.0120 9.2800 33.8883 9.9833 6.3212 5.3537 1.0994 15.6225 11.5910 3.7283 1.9702 3.8566 102.0868 0.5341 5.0202 5.3886 17.0644 316.4437 27.7884 53.6298 120.4940 4.0076 58.1148 5.3773 21.8241 14.0252 5.0240 185.8057 297.3106 160.0774 0.0162 79.7284 79.5019 128.1207 16.5825 61.1071 10.5344 20.0467 4.8215 89.2310 57.2105 12.2354 8.8746 103.3557 18.5829 644.9270 160.2672 216.5912 14.4375 119.1603 48.2584 16.0858 24.0457 20.2870 10.5089 29.0704 43.4121 7.9864 8.2826 11.2825 21.5368 6.9238 28.6311 8.3800 23.3304 174.9487 57.0208
temp: 298.150 k
press: 1.00000 atm
elementType: 8 8 8 8 7 6 6 6 6 6 6 6 6 6 6 6 6 6 6 6 6 1 1 1 1 1 1 1 1 1 1 1 1 1 1 1
symmnumber: 1
zpe: 727922.9 jmol-1
zpe.correction: 0.277251 hartree
zpe.thermalcorrener: 0.295469 hartree
zpe.thermalcorrenthalpy: 0.296414 hartree
zpe.thermalcorrgfe: 0.229890 hartree
zpe.sumelectzpe: -972.884242 hartree
zpe.sumelectthermal: -972.866024 hartree
zpe.sumelectthermalent: -972.865079 hartree
zpe.sumelectthermalfe: -972.931603 hartree
dipole: 1.2397 -4.8001 0.0041
dipole: 4.9576
quadrupole: -98.4693 -104.5443 -127.0810
quadrupole: 6.6419 -0.1556 0.1900
quadrupole: 11.5622 5.4872 -17.0495 6.6419 -0.1556 0.1900
hfenergy: -973.1614931 hartree
pointgroup: C01 [X(C16H15N1O4)]
dipole: -0.3439295 -1.9186389 -0.0694999 debye
polarizability: 315.6338938|-10.4615356|240.6245069|5.3895898|3.5510447|84.5604683 unknown
InChI: InChI=1S/C16H15NO4/c1-2-21-16(20)11-7-3-5-9-13(11)17-15(19)12-8-4-6-10-14(12)18/h3-10,17-18H,2H2,1H3
charge 0 multiplicity 1
36 atoms
O  -3.493807 -1.541795 -0.18769
O  1.548776 -1.839673 0.083039
O  1.764181 2.383379 0.100022
O  -1.188064 -1.782671 -0.103419
N  0.310183 0.529215 0.026256
C  -0.934353 1.206196 0.006001
C  -2.171631 0.459722 -0.062118
C  2.79309 0.2153 0.078586
C  -1.016582 2.631621 0.052437
C  1.580682 1.122054 0.071131
C  -3.412554 1.157247 -0.079512
C  -2.259798 3.287416 0.033783
C  -3.470819 2.558303 -0.032174
C  -2.198284 -1.020785 -0.116824
C  2.795176 -1.208494 0.079551
C  4.056231 0.866172 0.084157
C  4.001447 -1.947133 0.082302
C  5.265354 0.145792 0.087066
C  5.237323 -1.269382 0.084953
C  -3.596011 -3.029551 -0.2413
C  -5.082867 -3.364525 -0.303064
H  0.270207 -0.511529 0.006958
H  -0.086992 3.197973 0.101573
H  -4.328551 0.563934 -0.131696
H  -2.278902 4.382572 0.071431
H  -4.436339 3.073739 -0.046708
H  4.042277 1.960607 0.08582
H  3.969749 -3.044228 0.083881
H  6.221339 0.678555 0.090534
H  6.170214 -1.843544 0.086757
H  -3.044649 -3.385872 -1.130469
H  -3.104773 -3.445907 0.656966
H  -5.217037 -4.460925 -0.343959
H  -5.61054 -2.983244 0.587789
H  -5.549759 -2.924235 -1.200649
H  1.588584 -2.824303 0.050289
