program: Gaussian 09
title: 000087433
version: EM64L-G09RevD.01
frameworkgroup: C1[X(C18H23NO2)]
method: RPBEPBE
basis: SDD
operation: Freq
keyword: #p
keyword: freq=noraman
keyword: PBEPBE/SDD
title: #p freq=noraman PBEPBE/SDD
converged: NO YES NO NO
title: Mulliken charges:
elementType: O O N C C C C C C C C C C C C C C C C C C H H H H H H H H H H H H H H H H H H H H H H H
charge: -0.235172 -0.263475 -0.090141 0.278746 -0.199811 -0.286385 -0.498558 -0.561934 -0.458400 0.412765 -0.418342 -0.406668 -0.420209 0.048453 0.147632 -0.566207 -0.643556 -0.406563 0.316186 -0.386819 -0.535609 0.232883 0.249604 0.205739 0.236505 0.215388 0.211354 0.199419 0.234957 0.226086 0.181898 0.204333 0.196980 0.199946 0.230287 0.252627 0.195106 0.218289 0.261922 0.280181 0.245728 0.224686 0.245912 0.224238
chargesum: 0.00000
title: Mulliken charges with hydrogens summed into heavy atoms:
elementType: O O N C C C C C C C C C C C C C C C C C C
charge: -0.235172 -0.263475 -0.090141 0.278746 0.033073 -0.036780 -0.056314 -0.135193 -0.024024 0.412765 -0.010358 -0.005356 0.010024 0.048453 0.147632 -0.313580 0.031760 -0.126382 0.316186 -0.141091 0.159228
polarizability: 2.68631723e+02 3.51574533e+00 1.90731270e+02 9.44637985e-01 1.57876646e+01 1.62805614e+02
1716.lowfreq: -12.9132 -8.1443 -0.0007 -0.0005 0.0006 7.6002 37.0649 46.0976 73.1440
frequency: 36.0375 45.7550 73.1246 87.7451 95.1726 127.5594 158.9924 173.2940 181.4535 198.3520 215.5467 224.4988 237.2803 267.6880 273.0889 292.1278 306.1255 318.9553 349.8108 376.6624 403.6682 408.7048 422.4829 462.9875 481.3812 514.2306 528.6386 552.9037 560.4274 580.4022 640.2277 642.1923 686.8018 691.0484 716.8467 752.1836 768.9831 783.9402 829.5335 841.2852 844.4255 869.5599 886.2604 888.8549 896.8414 920.4799 968.8568 981.2422 986.8831 998.4317 1008.9667 1019.6171 1052.9621 1061.1949 1066.2845 1075.5342 1102.8418 1111.3163 1111.4799 1114.3924 1129.2294 1135.2928 1149.2138 1156.3052 1161.3977 1172.9971 1189.8972 1207.1428 1219.3551 1232.5511 1242.0658 1261.1580 1265.2119 1275.4262 1287.0939 1298.5878 1309.5093 1318.7874 1325.0615 1332.3103 1338.4848 1345.9348 1348.2441 1355.4985 1365.4165 1373.6873 1425.9630 1434.1130 1437.7516 1466.7044 1466.7833 1467.6911 1468.8664 1471.3404 1472.6606 1475.4704 1479.3395 1480.0179 1487.7193 1491.4581 1554.5362 1573.7244 1620.3908 2839.3978 2865.2690 2947.4173 2964.6385 2969.9889 2974.1004 2983.3248 2987.5482 2993.8827 2997.5418 3016.7326 3017.7210 3024.3701 3027.3336 3046.9688 3054.8878 3057.3052 3059.7397 3076.9831 3127.5843 3141.9748 3159.5118 3166.9504
redmass: 3.6778 2.7148 3.0289 3.5320 4.0471 4.0672 3.8251 2.4877 2.1184 1.3833 1.2086 3.1191 1.8266 3.3819 2.8885 2.6455 3.9961 5.9354 3.4581 3.9089 3.5150 4.2253 3.6364 3.2864 2.7487 4.6909 4.3241 3.1720 3.1712 3.0508 5.2131 3.6481 5.0789 4.0878 2.9993 1.8275 2.9248 2.5719 1.5800 3.3214 2.3164 2.6023 2.7199 1.6819 1.8186 2.3008 2.2696 1.3937 2.5818 3.0422 3.1269 2.5496 2.1700 2.1793 1.8631 2.9193 1.7546 1.4645 1.2617 2.3269 2.2064 1.8268 1.5983 1.3365 1.7192 1.5353 1.5081 1.7272 2.3326 1.6375 1.7339 1.6975 1.2884 1.5771 2.1389 1.6912 1.4476 1.3398 1.4080 1.4273 1.3588 1.5783 1.3969 1.4825 1.4922 5.9779 2.8543 1.1733 1.3686 1.0705 1.0600 1.2337 1.0777 1.0838 1.0737 1.3264 1.4411 1.0638 1.1122 1.0936 8.1405 7.5708 7.1915 1.0717 1.0565 1.0844 1.0327 1.0635 1.0646 1.0784 1.0635 1.0621 1.0656 1.0849 1.0753 1.0965 1.1012 1.1001 1.1042 1.1025 1.1014 1.1008 1.0998 1.0882 1.0900 1.0951
irintensity: 1.5236 0.4253 0.3186 3.0437 2.7368 4.3110 3.8413 1.6944 0.8598 0.3336 0.1144 3.8787 0.2321 1.6816 1.3882 1.0605 0.0660 0.4320 9.2067 2.2676 0.9184 0.5717 2.3987 2.3798 0.7755 24.1697 32.7897 2.1088 0.7994 0.8409 3.8608 0.8077 3.1926 17.6271 10.7005 3.4380 1.5006 20.9068 15.5751 14.1635 25.1706 6.1087 0.1343 8.7578 12.1245 2.5259 2.2853 3.0178 34.4900 29.8075 19.9951 4.8477 32.4051 27.9167 20.7367 6.2737 3.3938 3.4970 0.1892 6.0403 4.3763 10.9364 17.2730 4.0980 18.7125 4.8446 14.7443 40.7061 126.6954 40.5959 19.3851 72.4144 4.7641 35.8371 63.3874 33.9736 8.5611 6.3669 0.4190 2.5879 1.2119 20.8754 0.4719 4.8794 22.3712 13.5881 4.5033 12.0015 0.4677 14.3493 9.8555 11.7893 20.8848 13.4952 43.6589 17.6080 18.7438 7.5283 10.7719 2.6935 14.7988 283.0209 162.1602 92.9710 228.3302 49.9814 78.6910 24.8283 21.4845 37.9427 11.7412 91.9557 22.9157 36.1527 63.1401 19.1410 21.0091 40.2178 44.3862 40.0020 95.8000 19.9367 23.9809 0.2166 4.7643 17.9183
temp: 298.150 k
press: 1.00000 atm
elementType: 8 8 7 6 6 6 6 6 6 6 6 6 6 6 6 6 6 6 6 6 6 1 1 1 1 1 1 1 1 1 1 1 1 1 1 1 1 1 1 1 1 1 1 1
symmnumber: 1
zpe: 980017.5 jmol-1
zpe.correction: 0.373269 hartree
zpe.thermalcorrener: 0.392178 hartree
zpe.thermalcorrenthalpy: 0.393123 hartree
zpe.thermalcorrgfe: 0.327073 hartree
zpe.sumelectzpe: -903.314398 hartree
zpe.sumelectthermal: -903.295489 hartree
zpe.sumelectthermalent: -903.294545 hartree
zpe.sumelectthermalfe: -903.360594 hartree
dipole: 1.4682 2.2680 1.7989
dipole: 3.2459
quadrupole: -102.2926 -129.6834 -128.1219
quadrupole: -11.0673 -5.3207 -5.4646
quadrupole: 17.7401 -9.6508 -8.0893 -11.0673 -5.3207 -5.4646
hfenergy: -903.6876671 hartree
pointgroup: C01 [X(C18H23N1O2)]
dipole: -0.5603517 0.9736916 -0.6072145 debye
polarizability: 268.4866459|-2.9234496|194.2679029|4.3491107|-11.8159304|159.4140579 unknown
InChI: InChI=1S/C18H23NO2/c1-19-10-9-18-8-4-3-5-14(18)16(19)17(20)13-7-6-12(21-2)11-15(13)18/h6-7,11,14,16H,3-5,8-10H2,1-2H3
charge 0 multiplicity 1
44 atoms
O  1.216285 -2.638906 1.412162
O  -4.108164 0.294241 -0.816051
N  2.709577 -0.972983 -0.760616
C  0.753104 1.17948 -0.439803
C  1.822491 0.902168 0.664106
C  2.247734 -0.576788 0.59754
C  1.331193 0.747297 -1.857347
C  0.465611 2.715187 -0.441413
C  1.334882 1.27532 2.101062
C  -0.47518 0.28236 -0.167932
C  2.728306 0.096788 -1.770442
C  0.435097 3.376292 0.973992
C  0.210925 2.344872 2.100334
C  1.046467 -1.502058 0.869478
C  -0.287936 -1.0235 0.403655
C  -1.775081 0.657262 -0.555435
C  3.798322 -1.953459 -0.791243
C  -1.400212 -1.885836 0.56743
C  -2.877326 -0.218104 -0.386632
C  -2.696934 -1.505729 0.180956
C  -5.291314 -0.560159 -0.672825
H  2.701981 1.53229 0.424533
H  3.028352 -0.788954 1.359871
H  1.378194 1.628188 -2.525747
H  0.647299 0.017868 -2.325407
H  -0.472252 2.925459 -0.987263
H  1.266172 3.197244 -1.035342
H  2.205149 1.648583 2.675618
H  0.977604 0.372026 2.631877
H  2.977422 -0.356721 -2.748945
H  3.514566 0.869216 -1.570398
H  -0.348116 4.156621 1.009993
H  1.397696 3.893477 1.160807
H  0.177229 2.852421 3.08333
H  -0.771101 1.857134 1.961326
H  -1.981163 1.634754 -0.999819
H  4.782234 -1.533109 -0.464783
H  3.917016 -2.351056 -1.815879
H  3.549702 -2.797822 -0.12453
H  -1.213231 -2.869734 1.011621
H  -3.535859 -2.193769 0.3189
H  -5.188183 -1.490617 -1.263505
H  -6.125678 0.039092 -1.065294
H  -5.477979 -0.811938 0.38886
