program: Gaussian 09
title: 000087388
version: EM64L-G09RevD.01
frameworkgroup: C1[X(C16H14)]
method: RPBEPBE
basis: SDD
operation: Freq
keyword: #p
keyword: freq=noraman
keyword: PBEPBE/SDD
title: #p freq=noraman PBEPBE/SDD
converged: YES YES NO NO
title: Mulliken charges:
elementType: C C C C C C C C C C C C C C C C H H H H H H H H H H H H H H
charge: 0.202585 0.237780 0.441036 0.247324 0.353378 -0.782616 -0.672052 -0.367537 0.466198 -0.395645 -0.385682 -0.391098 -0.857231 -0.260200 -0.266056 -0.815102 0.236959 0.245089 0.220449 0.224107 0.246083 0.229680 0.231231 0.242263 0.231220 0.226699 0.226320 0.225272 0.229691 0.229857
chargesum: 0.00000
title: Mulliken charges with hydrogens summed into heavy atoms:
elementType: C C C C C C C C C C C C C C C C
charge: 0.202585 0.237780 0.441036 0.247324 0.353378 -0.545657 -0.426963 -0.147088 0.466198 -0.171538 -0.139599 -0.161418 -0.152518 -0.033501 -0.039737 -0.130282
polarizability: 2.87659375e+02 -3.67055820e+00 1.89748553e+02 -8.50102384e-03 -1.19473045e-02 7.58217909e+01
1716.lowfreq: -7.6207 -6.1630 -0.0010 -0.0007 -0.0007 7.8796 65.8355 74.9927 93.3004
frequency: 65.8242 74.9811 93.2946 130.9494 193.6609 195.0805 212.1198 276.2792 291.2041 319.5759 320.0193 386.1172 418.1646 435.8259 442.5360 493.0450 536.0151 537.4823 568.8500 569.9925 622.1224 658.9538 685.7205 741.2184 766.2760 769.8479 776.5038 795.3021 837.6447 870.1026 890.1827 931.1874 934.5857 954.5022 965.0628 985.7875 988.6729 992.9627 1019.2911 1040.9707 1048.6261 1052.0508 1071.3619 1123.6772 1159.4973 1180.0209 1192.3601 1227.8964 1255.2981 1267.4569 1291.3797 1315.5130 1379.8790 1392.9216 1396.5952 1398.6698 1402.7102 1420.9226 1448.4741 1452.3708 1469.3795 1472.4631 1474.7298 1486.8995 1498.6371 1537.2918 1578.1286 1614.9514 1625.2508 1635.7491 2971.1920 2974.2240 3045.2700 3051.1884 3083.4358 3084.7501 3113.9214 3116.9871 3119.0284 3126.3546 3139.8618 3149.9298 3157.8418 3167.4407
redmass: 1.1749 2.7756 3.3342 3.1790 3.5949 3.6494 1.0967 3.1096 3.0618 3.7771 3.5588 4.5648 3.0906 4.7578 2.9098 5.8040 3.2361 4.2460 2.9190 5.2511 2.8126 5.9053 5.3361 2.8785 5.7158 1.4765 4.9293 1.5340 1.5910 1.2791 1.9624 2.6583 1.8290 1.4166 1.3517 1.9388 1.3311 4.0085 1.7982 2.8405 1.5640 1.6011 2.0569 2.2363 1.3342 1.1011 1.6113 1.6416 1.7148 2.8390 1.6721 1.9839 2.7727 2.5700 1.3155 1.9080 2.5537 3.4089 2.6022 2.8298 1.0459 1.0459 1.1722 1.2933 2.6840 3.8087 7.3635 5.7512 6.5143 6.5527 1.0378 1.0372 1.0971 1.0974 1.0986 1.0982 1.0915 1.0905 1.0882 1.0850 1.0897 1.0951 1.0929 1.0993
irintensity: 1.0592 0.3106 0.3768 1.9956 0.7650 0.7098 0.3879 0.2620 1.1263 1.1689 0.7712 0.0503 4.2009 1.5852 9.8076 1.5250 0.0752 0.4968 0.3656 1.4260 3.0776 3.9627 0.5688 21.9709 0.4552 72.2621 0.1702 17.0824 15.5202 3.3802 5.3933 1.0875 16.9604 0.8118 3.0413 3.4660 0.0113 7.6205 0.3422 10.6614 4.3979 16.5642 0.1270 3.0987 0.4574 0.7681 0.7359 5.7453 8.4552 0.0146 0.3090 0.2312 7.0227 2.2102 10.3042 8.3159 10.4280 3.5322 5.4700 12.4452 12.1356 15.2700 18.2383 3.8454 22.2509 0.5360 0.2118 4.0379 3.6159 30.0002 43.2214 46.1211 20.1205 21.7081 16.8043 19.2345 2.0364 38.9406 17.8042 1.7977 9.2181 1.0559 49.0229 32.9949
temp: 298.150 k
press: 1.00000 atm
elementType: 6 6 6 6 6 6 6 6 6 6 6 6 6 6 6 6 1 1 1 1 1 1 1 1 1 1 1 1 1 1
symmnumber: 1
zpe: 645747.2 jmol-1
zpe.correction: 0.245952 hartree
zpe.thermalcorrener: 0.259005 hartree
zpe.thermalcorrenthalpy: 0.259949 hartree
zpe.thermalcorrgfe: 0.206740 hartree
zpe.sumelectzpe: -617.041115 hartree
zpe.sumelectthermal: -617.028062 hartree
zpe.sumelectthermalent: -617.027118 hartree
zpe.sumelectthermalfe: -617.080327 hartree
dipole: -0.2957 0.2922 0.0009
dipole: 0.4157
quadrupole: -79.2656 -81.8137 -100.9545
quadrupole: 1.1335 -0.0040 -0.0014
quadrupole: 8.0790 5.5309 -13.6099 1.1335 -0.0040 -0.0014
hfenergy: -617.2870672 hartree
pointgroup: C01 [X(C16H14)]
dipole: 0.1197021 0.1114073 -0.0022034 debye
polarizability: 287.7912018|0.7401055|189.5863609|-0.026538|-1.8586258|75.8521555 unknown
InChI: InChI=1S/C16H14/c1-11-7-8-15-13(9-11)10-12(2)14-5-3-4-6-16(14)15/h3-10H,1-2H3
charge 0 multiplicity 1
30 atoms
C  0.55394 -0.534597 0.010952
C  -0.903868 -0.673341 0.013613
C  1.126256 0.785848 -0.010001
C  -1.735412 0.509099 -0.006105
C  -1.124345 1.834705 -0.027863
C  0.257367 1.939361 -0.028913
C  2.547127 0.946209 -0.012112
C  1.452531 -1.645332 0.027887
C  3.417509 -0.153558 0.005063
C  -1.543733 -1.95122 0.035496
C  -3.157973 0.355502 -0.003612
C  2.840079 -1.462434 0.024961
C  -1.988762 3.081813 -0.049014
C  -2.939312 -2.074594 0.037602
C  -3.75655 -0.910307 0.017689
C  4.925607 0.018662 0.002631
H  0.723866 2.932635 -0.045037
H  2.957834 1.963902 -0.027862
H  1.061068 -2.667244 0.043242
H  -0.93792 -2.862272 0.051503
H  -3.791821 1.247534 -0.018602
H  3.502058 -2.337178 0.038203
H  -2.645672 3.140074 0.840057
H  -1.363494 3.98994 -0.064411
H  -2.645632 3.109872 -0.939577
H  -3.401074 -3.067991 0.054781
H  -4.847991 -1.005472 0.019151
H  5.2126 1.084111 -0.008443
H  5.383728 -0.445507 0.896592
H  5.382989 -0.463718 -0.88207
