program: Gaussian 09
title: 000087391
version: EM64L-G09RevD.01
frameworkgroup: C1[X(C10H24O3Si)]
method: RPBEPBE
basis: SDD
operation: Freq
keyword: #p
keyword: freq=noraman
keyword: PBEPBE/SDD
title: #p freq=noraman PBEPBE/SDD
converged: YES YES NO NO
title: Mulliken charges:
elementType: Si O O O C C C C C C C C C C H H H H H H H H H H H H H H H H H H H H H H H H
charge: 1.544708 -0.609423 -0.600376 -0.611971 -0.882967 -0.020762 -0.687643 -0.701543 -0.205357 -0.192905 -0.224853 -0.659932 -0.666251 -0.658082 0.244085 0.238761 0.229251 0.195918 0.203932 0.252718 0.203450 0.211566 0.215093 0.200931 0.199718 0.193879 0.212182 0.222753 0.205244 0.200625 0.227664 0.220736 0.198474 0.227115 0.223225 0.206239 0.226796 0.217002
chargesum: 0.00000
title: Mulliken charges with hydrogens summed into heavy atoms:
elementType: Si O O O C C C C C C C C C C
charge: 1.544708 -0.609423 -0.600376 -0.611971 -0.400121 0.208490 -0.035075 -0.071434 0.195292 0.213156 0.203144 -0.010907 -0.017437 -0.008045
polarizability: 1.54209518e+02 -1.70549191e+00 1.38933653e+02 -3.04963595e-02 -5.53799220e-01 1.35526160e+02
1716.lowfreq: -14.9939 -5.8624 -3.1033 -0.0023 -0.0020 -0.0015 11.1529 14.1052 21.2940
frequency: -13.4975 12.3441 20.7492 29.1853 36.3375 52.3089 55.2320 65.7426 79.8426 88.8434 123.3441 167.9834 181.8299 202.7418 204.0215 231.9770 242.8232 247.1307 255.0508 271.5362 287.8684 291.0930 355.1494 374.9276 379.3294 404.2615 413.8008 468.6631 577.5874 680.3962 688.2398 758.1856 801.9064 803.4510 804.4831 808.3381 835.6015 921.7876 924.1978 934.4522 939.3872 954.6607 959.3218 1055.8231 1059.7439 1061.9083 1076.7618 1094.8390 1101.7853 1103.8312 1110.9514 1133.6768 1136.5998 1153.4490 1175.5524 1213.5384 1241.0196 1258.1586 1262.3851 1275.4131 1331.5752 1332.7831 1357.4414 1359.7824 1363.9402 1375.9644 1383.2385 1389.0388 1390.9458 1396.1680 1419.2991 1457.2645 1457.7005 1461.6120 1464.7376 1468.7285 1474.3550 1476.8164 1477.9523 1478.1615 1486.2460 1488.3781 1488.6085 1493.2287 2946.6272 2948.0938 2963.0844 2969.7097 2974.0132 2980.6070 2985.1669 2987.6749 2988.4362 2990.8855 2998.9322 3008.1664 3036.8706 3048.6309 3056.3611 3065.5451 3066.4943 3076.7803 3083.0320 3085.3585 3085.6537 3095.1135 3099.0012 3100.6619
redmass: 2.5082 2.2798 2.6837 2.7648 2.4139 2.4265 3.0901 2.9500 4.0893 2.7015 3.7948 2.6299 2.5738 1.0772 2.4251 1.2607 1.5659 1.2087 1.2822 2.4541 2.4605 3.0421 3.3325 2.7827 2.5586 3.3194 2.5688 4.6668 4.0815 3.6488 5.5178 3.8069 1.5290 1.1259 1.3117 1.0993 2.3484 1.1806 2.3481 2.5976 2.7032 1.4881 1.8895 3.0742 2.9173 2.0131 4.5406 2.1444 2.1070 2.1562 2.1507 1.4592 1.4782 1.6107 1.8482 1.4775 1.3336 1.1340 1.1368 1.1134 1.3883 1.3716 1.2482 1.2460 1.2159 1.2109 1.2458 1.2561 1.2554 1.2028 1.0860 1.0420 1.0414 1.0441 1.0449 1.0546 1.0516 1.0486 1.0458 1.0463 1.0520 1.0776 1.0768 1.0827 1.0557 1.0575 1.0353 1.0376 1.0614 1.0356 1.0794 1.0360 1.0363 1.0576 1.1071 1.1048 1.1000 1.1064 1.0994 1.0997 1.0983 1.0980 1.0995 1.0986 1.0984 1.1024 1.1014 1.1014
irintensity: 0.0320 0.1718 0.2243 2.9689 0.6696 2.2534 2.4420 0.6027 2.2220 1.9790 6.7363 2.5092 4.6035 0.3571 3.2248 1.2327 2.2926 0.3712 3.4435 10.3258 6.7692 16.2286 6.4767 9.8709 2.0762 11.3043 7.5742 43.0333 7.8000 35.4402 100.8421 46.6292 40.3162 7.3433 16.0700 4.5432 11.6904 4.5130 58.6001 97.0247 99.8398 3.7163 2.8864 216.9069 245.2956 81.6151 219.0204 59.2481 9.7752 16.7325 26.4407 4.4349 7.0282 21.9624 13.2485 0.8391 25.3523 0.1938 1.1261 2.7315 5.0424 3.0370 10.6847 12.1672 9.0130 16.7286 24.5927 26.1761 25.9495 16.2091 8.5034 11.6063 10.3474 8.9639 1.3064 7.2458 2.0623 4.0889 14.0800 9.0066 11.4457 10.3579 5.1767 0.9634 61.8884 55.2447 36.0643 38.6178 8.5956 24.0312 11.8970 26.7573 34.1850 48.1825 43.6845 33.1898 8.8178 9.3970 5.6813 41.4711 94.8813 61.0433 28.0774 41.4808 38.4819 46.1691 41.5515 40.5242
temp: 298.150 k
press: 1.00000 atm
elementType: 14 8 8 8 6 6 6 6 6 6 6 6 6 6 1 1 1 1 1 1 1 1 1 1 1 1 1 1 1 1 1 1 1 1 1 1 1 1
symmnumber: 1
zpe: 863502.9 jmol-1
zpe.correction: 0.328891 hartree
zpe.thermalcorrener: 0.349131 hartree
zpe.thermalcorrenthalpy: 0.350075 hartree
zpe.thermalcorrgfe: 0.276207 hartree
zpe.sumelectzpe: -909.409120 hartree
zpe.sumelectthermal: -909.388880 hartree
zpe.sumelectthermalent: -909.387936 hartree
zpe.sumelectthermalfe: -909.461804 hartree
dipole: -1.6277 -0.1460 -0.6843
dipole: 1.7717
quadrupole: -92.6491 -93.4264 -91.9045
quadrupole: -2.5409 0.2493 1.8757
quadrupole: 0.0109 -0.7664 0.7555 -2.5409 0.2493 1.8757
hfenergy: -909.7380109 hartree
pointgroup: C01 [X(C10H24O3Si1)]
dipole: 0.6802729 -0.1138666 0.1007145 debye
polarizability: 150.3043865|-6.9338884|139.9655927|-3.5065729|-0.0318748|138.3993521 unknown
InChI: InChI=1S/C10H24O3Si/c1-6-11-14(12-7-2,13-8-3)9-10(4)5/h10H,6-9H2,1-5H3
charge 0 multiplicity 1
38 atoms
Si -0.143775 -0.1090 0.372713
O  1.133747 -0.81665 1.306861
O  0.516124 1.028625 -0.745841
O  -0.864475 -1.4549 -0.407713
C  -1.451979 0.788845 1.398494
C  -2.793171 1.099654 0.666895
C  -2.627879 2.24092 -0.364784
C  -3.890479 1.454051 1.699576
C  2.201072 -0.096538 2.010026
C  1.426177 0.731194 -1.860407
C  -0.361205 -2.83122 -0.503466
C  3.305638 -1.096891 2.35521
C  1.700917 2.036406 -2.608069
C  0.282979 -3.090404 -1.871246
H  -1.651625 0.133958 2.271111
H  -1.019531 1.728605 1.797453
H  -3.110495 0.18361 0.128141
H  -2.359171 3.186372 0.146028
H  -3.571262 2.408527 -0.917165
H  -1.82737 2.016041 -1.09108
H  -3.600396 2.346989 2.287146
H  -4.063421 0.621691 2.407458
H  -4.84982 1.678278 1.196232
H  2.594689 0.721452 1.370637
H  1.789744 0.360252 2.934325
H  2.370861 0.297544 -1.46895
H  0.955805 -0.015589 -2.531896
H  0.358948 -3.023313 0.31531
H  -1.243171 -3.48322 -0.364924
H  4.121675 -0.598757 2.911891
H  2.900049 -1.911472 2.979867
H  3.724929 -1.542004 1.436112
H  2.381714 1.858484 -3.461917
H  0.758065 2.462879 -2.991753
H  2.16553 2.777001 -1.934386
H  0.561817 -4.157393 -1.965479
H  -0.423995 -2.84228 -2.682305
H  1.196538 -2.482746 -2.001301
