program: Gaussian 09
title: 000008056
version: EM64L-G09RevD.01
frameworkgroup: C1[X(C4H8Br2)]
method: RPBEPBE
basis: SDD
operation: Freq
keyword: #pfreq=noraman
keyword: PBEPBE/SDD
title: #p freq=noraman PBEPBE/SDD
converged: NO YES NO NO
title: Mulliken charges:
elementType: Br Br C C C C H H H H H H H H
charge: -0.029083 -0.029129 -0.310302 -0.310078 -0.681375 -0.681592 0.229762 0.230132 0.230153 0.229602 0.280454 0.280463 0.280412 0.280582
chargesum: 0.00000
title: Mulliken charges with hydrogens summed into heavy atoms:
elementType: Br Br C C C C
charge: -0.029083 -0.029129 0.149591 0.149676 -0.120457 -0.120599
polarizability: 1.25397630e+02 -1.40745769e+01 5.32321812e+01 -2.66095061e-02 5.14753955e-03 4.29652224e+01
1716.lowfreq: -26.7914 -5.3703 -3.8415 -0.0001 -0.0001 0.0001 42.6675 80.0304 83.9799
frequency: 42.6660 80.0289 83.9790 132.4855 136.8955 297.4317 333.1096 608.2668 631.0424 746.1472 764.9716 864.0622 1006.3033 1008.5491 1033.9304 1071.8909 1076.2847 1208.6798 1224.0082 1242.8227 1280.5551 1288.8249 1304.0308 1338.5962 1449.5675 1450.6767 1470.0335 1482.0606 2993.7358 3001.6728 3043.5613 3048.6220 3049.2763 3067.1407 3132.6687 3134.7958
redmass: 5.1384 5.6381 1.9490 2.4148 31.0370 4.0109 4.9670 4.8445 5.5267 1.0648 1.1427 1.2637 4.3729 1.2248 4.5983 1.0204 3.2580 1.1403 1.4323 1.1782 1.1912 1.0564 1.2658 1.4080 1.0970 1.1006 1.0741 1.0980 1.0597 1.0587 1.1028 1.0567 1.0560 1.1048 1.1118 1.1108
irintensity: 3.8841 3.6845 0.5436 0.0006 0.0000 0.0001 20.2192 49.9158 0.0001 16.2098 0.0005 4.3364 0.0005 0.0027 31.7484 3.0383 0.0097 22.3033 0.0047 0.0013 2.8647 0.0116 95.2153 0.0002 5.3628 0.0074 0.0001 15.6112 0.0087 26.5706 0.0021 0.0058 42.2127 27.7614 0.0322 30.7180
temp: 298.150 k
press: 1.00000 atm
elementType: 35 35 6 6 6 6 1 1 1 1 1 1 1 1
symmnumber: 1
zpe: 293858.9 jmol-1
zpe.correction: 0.111925 hartree
zpe.thermalcorrener: 0.120109 hartree
zpe.thermalcorrenthalpy: 0.121053 hartree
zpe.thermalcorrgfe: 0.075514 hartree
zpe.sumelectzpe: -183.645921 hartree
zpe.sumelectthermal: -183.637737 hartree
zpe.sumelectthermalent: -183.636792 hartree
zpe.sumelectthermalfe: -183.682332 hartree
dipole: -0.0007 0.0005 0.0141
dipole: 0.0141
quadrupole: -76.7826 -54.5963 -55.9726
quadrupole: 1.7065 0.0031 0.0042
quadrupole: -14.3321 7.8542 6.4779 1.7065 0.0031 0.0042
hfenergy: -183.7578457 hartree
pointgroup: C01 [X(C4H8Br2)]
dipole: -0.0002579 0.0002468 0.0055365 debye
dipolederiv: -0.6695953 0.0490209 -0.0017928 0.159726 -0.1866878 0.0009589 -0.0033587 0.0006757 -0.1455014 -0.6698205 0.0490919 -0.0006791 0.1598391 -0.1868216 0.0001569 -0.0001154 0.0000906 -0.1455173 -0.2668129 -0.0209129 -0.0005081 -0.0489227 0.0317222 0.0016198 -0.0010581 0.0022837 0.1490533 -0.2675363 -0.0208395 -0.0006734 -0.0485844 0.0317095 -0.0006204 -0.0005908 -0.000699 0.1490364 0.8749696 -0.1972639 0.0040167 -0.149158 0.194551 -0.001348 0.0032603 -0.0013711 0.1291447 0.8751925 -0.1971653 0.0012341 -0.1493487 0.1947254 0.000302 0.0003037 -0.0000987 0.1290925 0.08034 0.0043524 -0.0027515 -0.0086752 -0.0114376 -0.0993293 0.007226 -0.1102119 -0.0482777 0.0789812 0.0043501 0.0030309 -0.0088065 -0.0062283 0.0981353 -0.006653 0.1090307 -0.0532881 0.0793485 0.0050081 -0.002577 -0.0081223 -0.0098288 -0.0987898 0.0077189 -0.109657 -0.0493996 0.0799939 0.0036298 0.003279 -0.0094204 -0.0078659 0.0987312 -0.006019 0.1097029 -0.0522161 -0.048863 0.0809932 0.0369771 0.0278572 -0.0134089 -0.0854196 -0.0098777 -0.0985386 -0.0130235 -0.0486494 0.0794702 -0.0391505 0.0278709 -0.0084717 0.0854527 0.0090023 0.0987723 -0.0180705 -0.0487704 0.0803585 -0.0381835 0.0279665 -0.0110219 0.0854971 0.0095272 0.0987081 -0.0155884 -0.0487781 0.0799063 0.0377781 0.0277786 -0.0109355 -0.085347 -0.0093656 -0.0986879 -0.0154441 unknown
polarizability: 123.7416738|-17.7425137|54.887077|0.2447668|-0.1050231|42.9662829 unknown
InChI: InChI=1S/C4H8Br2/c5-3-1-2-4-6/h1-4H2
charge 0 multiplicity 1
14 atoms
Br -3.638146 0.263701 -0.009347
Br 3.638312 -0.271561 0.0078
C  -0.688287 0.35936 -0.003942
C  0.687883 -0.366547 0.007047
C  -1.829232 -0.662555 0.007286
C  1.829302 0.654837 0.007485
H  -0.776688 1.021991 0.87773
H  -0.773609 0.998914 -0.902725
H  0.77893 -1.022296 -0.879426
H  0.770405 -1.01309 0.901204
H  -1.834237 -1.303954 -0.888039
H  -1.838351 -1.279708 0.919449
H  1.836983 1.284269 -0.896275
H  1.837032 1.283639 0.911652
