program: Gaussian 09
title: 000087353
version: EM64L-G09RevD.01
frameworkgroup: C1[X(C10H14Cl2Si)]
method: RPBEPBE
basis: SDD
operation: Freq
keyword: #p
keyword: freq=noraman
keyword: PBEPBE/SDD
title: #p freq=noraman PBEPBE/SDD
converged: YES YES NO NO
title: Mulliken charges:
elementType: Cl Cl Si C C C C C C C C C C H H H H H H H H H H H H H H
charge: -0.283260 -0.283276 0.857596 -0.142199 -0.677464 -0.654839 -0.677454 -0.149465 -0.288653 -0.288656 -0.227088 -0.227097 -0.225766 0.234747 0.223552 0.229612 0.233558 0.233560 0.212738 0.229607 0.223546 0.234743 0.253762 0.253755 0.234678 0.234678 0.235085
chargesum: 0.00000
title: Mulliken charges with hydrogens summed into heavy atoms:
elementType: Cl Cl Si C C C C C C C C C C
charge: -0.283260 -0.283276 0.857596 -0.142199 0.010447 0.025016 0.010443 -0.149465 -0.034890 -0.034901 0.007590 0.007581 0.009320
polarizability: 1.77292874e+02 7.43736509e-03 1.49953119e+02 -8.08111188e+00 4.37625488e-02 1.10111467e+02
1716.lowfreq: -15.6399 -6.7164 -1.9530 -0.0031 -0.0029 -0.0020 19.5165 36.9121 56.8570
frequency: 16.8208 36.8537 56.8532 92.8214 112.3138 127.2936 140.6657 180.6282 200.1444 224.8467 229.0535 249.1228 256.5552 277.9210 279.8947 366.2209 374.6827 390.9355 399.0870 465.2616 494.4348 513.8746 594.6160 613.3626 695.0052 701.1820 750.9082 808.2103 858.4774 927.4376 939.7299 943.3906 952.2212 980.4424 985.6528 1002.6687 1007.6851 1010.8231 1022.7503 1079.1889 1097.0302 1176.7390 1195.6134 1198.8159 1201.1164 1207.5439 1308.9841 1368.9373 1378.2539 1380.3738 1406.2166 1419.1863 1455.1512 1466.3957 1467.4576 1468.0477 1477.7856 1479.6251 1494.6438 1578.1238 1595.3971 2966.1198 2967.3264 2971.1731 3057.1256 3059.0974 3064.8741 3074.4506 3077.8186 3085.2254 3125.1046 3128.3892 3139.0209 3151.2138 3166.1905
redmass: 3.9078 2.7403 4.5201 9.7185 5.5019 7.1249 10.5545 1.0451 4.1108 1.9648 1.8209 1.4987 1.6234 3.7549 4.2120 2.5124 2.5148 2.7679 3.7707 4.5967 5.9337 16.4737 4.2847 6.5060 6.3835 1.8975 1.6987 2.8116 1.2475 1.3509 1.7177 1.6719 1.2025 1.3997 6.1685 1.3255 1.4032 1.4186 2.9674 1.6982 2.8466 1.0558 1.8050 1.2689 2.7224 2.7440 1.4109 5.2946 1.1798 1.1815 1.1899 2.1200 1.0471 1.1135 1.0477 1.7943 1.0478 1.0479 1.0541 5.5358 5.7743 1.0353 1.0356 1.0364 1.0992 1.0986 1.0973 1.1006 1.0998 1.1001 1.0853 1.0880 1.0921 1.0963 1.1017
irintensity: 0.0734 0.0774 0.5720 0.3272 0.2496 4.6081 4.0194 0.0004 8.1468 0.0048 0.7915 0.0010 0.2999 0.3291 0.3393 0.5936 0.9502 0.0208 17.1645 38.4733 86.2134 107.6575 50.3732 1.3450 19.8908 60.9557 32.1187 20.6705 0.0094 0.1319 2.8792 4.8597 0.0322 0.0265 2.6812 0.0693 4.3550 7.5865 0.7041 2.2242 49.6961 0.1332 28.7533 4.4870 0.2058 3.5789 6.3412 0.4231 18.5306 21.6759 11.7950 20.4881 0.2880 4.9888 0.0008 2.2863 15.1465 13.8661 29.9953 0.0029 1.5829 22.6157 27.6543 42.8064 1.2973 34.9884 49.2966 6.5064 28.2480 21.6796 0.3957 0.0240 4.6378 27.4084 27.9677
temp: 298.150 k
press: 1.00000 atm
elementType: 17 17 14 6 6 6 6 6 6 6 6 6 6 1 1 1 1 1 1 1 1 1 1 1 1 1 1
symmnumber: 1
zpe: 557547.2 jmol-1
zpe.correction: 0.212358 hartree
zpe.thermalcorrener: 0.228049 hartree
zpe.thermalcorrenthalpy: 0.228993 hartree
zpe.thermalcorrgfe: 0.167746 hartree
zpe.sumelectzpe: -1598.079267 hartree
zpe.sumelectthermal: -1598.063577 hartree
zpe.sumelectthermalent: -1598.062633 hartree
zpe.sumelectthermalfe: -1598.123879 hartree
dipole: -1.9143 -0.0058 3.9132
dipole: 4.3563
quadrupole: -89.9104 -99.5695 -106.7800
quadrupole: -0.0060 3.6562 0.0071
quadrupole: 8.8429 -0.8162 -8.0266 -0.0060 3.6562 0.0071
hfenergy: -1598.2916255 hartree
pointgroup: C01 [X(C10H14Cl2Si1)]
dipole: 0.5925004 0.0016011 1.6082303 debye
polarizability: 174.9598076|0.0088439|149.9531532|14.717335|-0.0225174|112.4444994 unknown
InChI: InChI=1S/C10H14Cl2Si/c1-10(2,3)13(11,12)9-7-5-4-6-8-9/h4-8H,1-3H3
charge 0 multiplicity 1
27 atoms
Cl -1.36435 1.787497 -1.975284
Cl -1.364173 -1.7916 -1.971764
Si -0.964738 -0.000813 -0.739727
C  -2.212691 0.000602 0.735052
C  -1.944597 1.275659 1.58358
C  -3.673823 -0.000081 0.216776
C  -1.944352 -1.272589 1.58629
C  0.874342 -0.000319 -0.289037
C  1.56949 -1.225382 -0.095002
C  1.569169 1.22517 -0.096513
C  2.926923 -1.223501 0.296962
C  2.926602 1.22413 0.295453
C  3.606401 0.000526 0.496113
H  -2.128422 2.198717 1.003943
H  -2.630573 1.280383 2.453005
H  -0.909972 1.30689 1.97371
H  -3.890719 -0.895605 -0.393198
H  -3.890833 0.893994 -0.395285
H  -4.366766 0.000894 1.080899
H  -0.909724 -1.302795 1.976494
H  -2.630331 -1.27559 2.455722
H  -2.127997 -2.196926 1.008641
H  1.059304 -2.180146 -0.267941
H  1.058756 2.179597 -0.270645
H  3.453368 -2.173803 0.438326
H  3.452798 2.174744 0.435644
H  4.66061 0.000846 0.795184
