program: Gaussian 09
title: 000087346
version: EM64L-G09RevD.01
frameworkgroup: C1[X(C6H12O4)]
method: RPBEPBE
basis: SDD
operation: Freq
keyword: #pfreq=noraman
keyword: PBEPBE/SDD
title: #p freq=noraman PBEPBE/SDD
converged: YES YES NO NO
title: Mulliken charges:
elementType: O O O O C C C C C C H H H H H H H H H H H H
charge: -0.454039 -0.454199 -0.300075 -0.213121 0.190476 -0.374015 -0.373470 -0.706907 0.270100 -0.506354 0.190917 0.214768 0.191056 0.214444 0.185408 0.258070 0.257709 0.349076 0.349114 0.224227 0.243355 0.243459
chargesum: 0.00000
title: Mulliken charges with hydrogens summed into heavy atoms:
elementType: O O O O C C C C C C
charge: -0.104962 -0.105085 -0.300075 -0.213121 0.190476 0.031670 0.032031 -0.005720 0.270100 0.204687
polarizability: 8.19216487e+01 1.38214933e-02 7.60937919e+01 -6.29956866e-01 -1.29799896e-02 7.54816124e+01
1716.lowfreq: -12.9245 -8.8468 0.0007 0.0010 0.0012 2.7680 54.8437 70.0211 92.4168
frequency: 54.7476 69.9595 92.3790 94.3028 142.2180 160.4130 186.5384 197.0415 199.8927 211.4770 236.8043 305.9328 317.4064 331.8617 388.4712 470.6026 515.5746 552.9067 719.8084 752.8704 856.7899 918.0260 945.0923 962.7104 967.1487 1003.9322 1012.7275 1094.8819 1112.1450 1123.0271 1146.7782 1168.6324 1175.3373 1186.9687 1213.3995 1277.7382 1317.5126 1384.1030 1393.8269 1412.1700 1422.1935 1449.7537 1462.5924 1465.1761 1467.1038 1471.0974 1480.8988 1662.6870 2935.0776 2944.1232 2997.5076 3001.8530 3001.9143 3011.4574 3099.6222 3103.9373 3132.4553 3141.3292 3585.9466 3586.5216
redmass: 4.1586 2.3400 5.1500 1.5159 2.3579 3.3326 1.2663 1.1823 2.8306 1.2209 2.4294 2.2441 4.3061 2.6107 7.2712 3.9018 4.1129 3.3134 5.5268 5.2154 2.8631 1.9775 3.3551 4.1361 1.7485 1.7366 7.0892 4.3192 1.2666 1.5370 1.4412 1.5607 1.9989 1.1654 1.0849 2.1123 1.8644 1.2095 1.3856 1.2732 1.2075 1.0503 1.0769 1.0535 1.0589 1.0535 1.0730 10.3981 1.0574 1.0579 1.0403 1.0299 1.1038 1.1028 1.0945 1.1045 1.1013 1.1049 1.0667 1.0667
irintensity: 1.2117 0.4998 4.3946 0.0708 4.4077 10.9167 7.9939 6.6853 56.7840 222.7472 4.9747 6.3493 24.1970 0.7056 1.3347 2.7533 43.7096 3.1567 5.3664 15.1790 0.6068 4.1334 8.3018 117.9985 5.5099 29.3187 24.8891 254.6107 0.0346 36.3631 21.5181 39.3137 1.9267 37.2637 0.5116 19.8794 12.7122 16.1773 0.0926 8.3147 15.8811 13.0672 12.3061 9.2851 4.3366 2.3864 18.4413 172.1459 3.7593 138.6575 25.8751 42.3678 0.3585 92.1271 20.4797 25.6673 8.0439 18.6225 6.2682 2.9747
temp: 298.150 k
press: 1.00000 atm
elementType: 8 8 8 8 6 6 6 6 6 6 1 1 1 1 1 1 1 1 1 1 1 1
symmnumber: 1
zpe: 467126.2 jmol-1
zpe.correction: 0.177919 hartree
zpe.thermalcorrener: 0.190831 hartree
zpe.thermalcorrenthalpy: 0.191776 hartree
zpe.thermalcorrgfe: 0.138949 hartree
zpe.sumelectzpe: -535.878824 hartree
zpe.sumelectthermal: -535.865911 hartree
zpe.sumelectthermalent: -535.864967 hartree
zpe.sumelectthermalfe: -535.917794 hartree
dipole: -0.4377 0.0118 -5.1167
dipole: 5.1354
quadrupole: -51.8751 -51.5264 -63.2217
quadrupole: 0.0377 0.9110 -0.0007
quadrupole: 3.6659 4.0147 -7.6806 0.0377 0.9110 -0.0007
hfenergy: -536.0567428 hartree
pointgroup: C01 [X(C6H12O4)]
dipole: 0.2155066 0.0274603 2.0086949 debye
dipolederiv: -0.5597107 -0.0548647 0.0452851 -0.0262243 -0.7326984 -0.2098166 0.0385603 -0.2609897 -0.2387293 -0.5575145 0.0506585 0.0507272 0.0219375 -0.7215668 0.2215742 0.0460021 0.2726314 -0.2521856 -1.2245399 0.0224001 0.3297957 0.0242198 -0.3014283 -0.0130893 0.4314733 -0.0151832 -0.7640914 -0.6169059 0.0025697 -0.247719 0.0082514 -0.2664684 -0.0048506 0.1233362 -0.0122183 -0.903314 -0.0843104 -0.0002363 -0.0785638 -0.0005942 -0.0333485 0.0010959 -0.1307176 0.0022796 -0.0450948 0.3657079 0.0435264 0.0153311 0.0014945 0.6327262 0.1200118 0.0589987 0.1038001 0.2517554 0.3653084 -0.0345814 0.0119165 0.0075089 0.6261792 -0.1305776 0.0555282 -0.1158834 0.2578485 0.0276146 -0.0009763 0.0543892 -0.0009072 -0.0374717 -0.0016891 0.0156253 -0.0009261 -0.0669146 1.3081897 -0.020503 -0.0288625 -0.0266038 0.2162084 0.0171651 -0.4601436 0.0258296 1.3147054 0.6358122 -0.0081593 -0.0806764 -0.0072686 0.2679814 0.0011888 0.0037227 -0.000538 0.2249427 -0.2170911 -0.0214161 -0.1286538 0.0078036 -0.0144267 -0.0244101 -0.0840622 -0.0406983 0.0207159 0.014482 -0.0164234 0.1297557 -0.0250317 -0.0071092 -0.0416725 0.0939876 -0.0500165 -0.1278361 -0.2170947 0.0247616 -0.1272986 -0.003277 -0.012876 0.029482 -0.0813547 0.0442595 0.0198079 0.0166499 0.0194575 0.1300752 0.0270534 -0.0061229 0.0337656 0.0940137 0.0431688 -0.1313947 -0.1756216 0.0054329 -0.0399823 0.0046921 0.0998751 0.0000294 -0.1013144 0.0014176 0.0416107 0.1038529 -0.0270362 -0.0241718 -0.0128233 -0.0109372 -0.1037409 0.0070287 -0.0990885 0.0424571 0.1048952 0.0216142 -0.0201734 0.0077239 -0.007988 0.1061321 0.010773 0.1000194 0.0378338 0.3710627 0.0079908 -0.0423135 -0.0027558 0.1575864 0.1063831 -0.042252 0.1712581 0.1386109 0.3704161 -0.0158928 -0.0453879 -0.0052405 0.1505307 -0.1052387 -0.0477193 -0.1700437 0.1463906 0.0026638 0.0033263 0.069199 0.0043881 0.114012 -0.0047332 0.1277516 -0.0058765 -0.079432 -0.0187382 -0.012803 0.0122867 -0.0678264 -0.0577038 -0.072607 -0.0804983 -0.0939868 0.0589533 -0.0151282 0.0111547 0.0150417 0.0634797 -0.0549534 0.0755975 -0.0787392 0.100785 0.0533604 unknown
polarizability: 81.8870848|-0.1726324|76.0990925|-0.7649216|0.0246296|75.5108758 unknown
InChI: InChI=1S/C6H12O4/c1-6(3-7,4-8)5(9)10-2/h7-8H,3-4H2,1-2H3
charge 0 multiplicity 1
22 atoms
O  0.72484 -2.437837 0.139578
O  0.805137 2.414925 0.070852
O  -1.50263 0.03973 0.697705
O  -1.066815 -0.002735 -1.585517
C  0.828559 -0.013338 0.043653
C  1.053653 -1.253914 0.944107
C  1.099036 1.244062 0.907576
C  1.751511 -0.047304 -1.19231
C  -0.644043 0.00686 -0.414255
C  -2.947559 0.064244 0.376791
H  2.118804 -1.277858 1.263464
H  0.400388 -1.189044 1.838212
H  2.166155 1.24187 1.221038
H  0.448816 1.226623 1.806103
H  2.809428 -0.066874 -0.869482
H  1.548088 -0.945784 -1.7949
H  1.586541 0.846176 -1.813858
H  0.758672 -3.245597 0.709052
H  0.863861 3.236598 0.617926
H  -3.455592 0.09102 1.351592
H  -3.226449 -0.838202 -0.193036
H  -3.1889 0.95798 -0.22309
