program: Gaussian 09
title: 000087461
version: EM64L-G09RevD.01
frameworkgroup: C1[X(C20H12ClNO6S)]
method: RPBEPBE
basis: SDD
operation: Freq
keyword: #p
keyword: freq=noraman
keyword: PBEPBE/SDD
title: #p freq=noraman PBEPBE/SDD
converged: YES YES NO NO
title: Mulliken charges:
elementType: Cl S O O O O O O N C C C C C C C C C C C C C C C C C C C C H H H H H H H H H H H H
charge: -0.218779 0.907189 -0.314670 -0.357496 -0.295008 -0.166076 -0.459698 -0.459862 -0.640738 0.226355 0.205775 0.271789 0.256819 0.056880 -0.118176 -0.211964 0.129319 0.205115 -0.566617 -0.375437 -0.377213 -0.229412 -0.225631 0.372732 -0.328411 -0.360379 -0.138380 -0.189275 -0.176618 0.267716 0.291014 0.293276 0.239798 0.240016 0.333948 0.392193 0.292028 0.279532 0.362333 0.292219 0.293796
chargesum: 0.00000
title: Mulliken charges with hydrogens summed into heavy atoms:
elementType: Cl S O O O O O O N C C C C C C C C C C C C C C C C C C C C
charge: -0.218779 0.907189 -0.314670 0.004838 -0.295008 -0.166076 -0.459698 -0.459862 0.085403 0.226355 0.205775 0.271789 0.256819 0.056880 -0.118176 -0.211964 0.129319 0.205115 -0.298901 -0.084423 -0.083937 0.010386 0.014385 0.372732 -0.036383 -0.080847 -0.138380 0.102944 0.117178
polarizability: 1.03206894e+03 -2.63611655e+01 2.95076734e+02 5.51084903e+00 2.23427331e+00 1.63875469e+02
1716.lowfreq: -5.5119 -2.0941 0.0019 0.0023 0.0024 5.7640 7.2632 14.0689 26.6496
frequency: 7.0368 13.8393 26.4509 38.4187 49.4797 54.5650 72.4193 103.8357 122.7320 127.1019 135.7349 150.1346 165.9456 173.5953 202.7428 212.2461 214.4923 261.0248 273.0303 277.5631 300.4220 313.6288 335.9887 350.4846 364.9973 375.8341 382.6496 397.8878 413.7910 416.3267 419.3307 421.5791 435.5064 446.2854 458.6241 487.9448 501.6476 507.2403 517.0270 561.4389 584.5136 600.7328 620.8370 631.7773 644.7233 674.1472 682.3918 706.5120 720.0219 730.6742 743.2143 788.7846 812.5733 819.1153 824.7251 827.5680 831.5878 840.9024 854.8552 863.8559 878.8593 922.7783 937.3728 956.9164 966.8150 981.1526 982.7448 989.0722 999.7341 1016.3582 1031.1301 1042.1187 1079.1678 1092.3989 1112.8183 1133.9940 1158.0501 1163.5674 1172.2125 1183.7038 1207.2312 1242.7509 1264.4553 1282.7401 1287.3257 1315.0849 1342.6996 1383.4312 1392.7402 1399.8120 1408.8068 1415.2135 1437.8046 1445.0712 1457.5946 1471.6818 1516.4726 1537.4959 1553.8624 1566.0587 1581.0317 1593.4448 1595.8008 1609.8829 1629.4514 3132.0633 3136.8680 3153.0318 3159.9228 3163.7783 3165.2455 3173.6742 3177.0543 3183.3104 3288.8859 3527.1084 3622.6322
redmass: 10.5770 10.0013 10.6208 8.3598 5.0058 12.5437 6.1843 5.5715 9.6089 7.9713 7.1528 8.4788 8.2560 16.2332 6.1941 14.8967 6.9837 6.2491 7.1378 7.1130 6.5444 9.4613 5.1199 7.9758 1.1950 7.4187 7.2410 11.8194 3.1432 6.6127 9.3648 3.7854 5.6792 9.3914 7.2876 6.8519 3.7155 3.5325 6.3241 1.2329 5.6221 7.2615 6.3628 6.2990 6.6876 5.6868 5.9382 4.2272 5.7100 4.2776 2.7057 5.7931 1.9367 17.3040 1.6400 1.1434 3.0487 1.4785 1.4668 2.8039 7.5152 5.5546 1.9284 18.2174 1.3231 1.5257 3.8075 3.8737 1.3881 1.3616 2.1659 2.4217 3.6754 2.3755 1.2788 1.8638 1.6035 1.3374 1.1262 1.9532 2.9163 1.7437 2.1590 3.4182 1.3079 4.0984 3.7492 6.0691 8.6934 9.6303 4.0279 3.1137 4.2012 2.8316 2.2612 2.6586 7.1124 5.4345 2.3120 4.4498 6.5805 5.5490 6.3720 6.7127 7.8401 1.0919 1.0864 1.0905 1.0891 1.0897 1.0946 1.0997 1.0970 1.0975 1.0611 1.0659 1.0903
irintensity: 0.9606 0.2237 0.4372 8.0609 0.1053 0.4385 0.3897 0.8282 3.0993 1.9440 0.8558 0.9767 0.2424 0.9861 1.5499 95.6012 20.2585 21.2428 14.4407 31.7082 5.5729 8.4588 7.6196 1.4103 83.4303 13.2736 14.9449 18.3465 11.9592 55.2907 25.2973 3.1579 18.7670 7.7373 23.2101 7.7087 0.4502 49.2101 2.9006 139.6862 2.3490 1.7686 9.3461 10.6581 26.0119 3.3210 4.5520 6.8245 5.9006 6.2243 28.8080 8.0233 55.2417 252.1201 49.1867 115.3028 75.9113 52.6796 32.8131 0.1061 21.3510 60.3238 0.0947 54.5621 1.3713 0.2991 1.3978 82.4690 4.5579 0.0474 11.6387 25.1825 131.2921 83.6763 11.8380 9.6375 56.4470 12.0669 31.0189 20.3128 134.5168 9.6755 2.7483 901.2940 47.1817 315.5564 36.5091 24.2294 215.1161 14.4535 18.9465 57.3601 12.8942 25.7870 7.6310 14.8127 108.6893 474.4173 12.1508 66.2409 90.1848 19.2685 74.3924 0.6543 68.4275 0.6921 4.1976 13.8224 1.8538 2.5061 3.1148 47.7627 0.9528 0.2210 301.1290 23.6402 45.9319
temp: 298.150 k
press: 1.00000 atm
elementType: 17 16 8 8 8 8 8 8 7 6 6 6 6 6 6 6 6 6 6 6 6 6 6 6 6 6 6 6 6 1 1 1 1 1 1 1 1 1 1 1 1
symmnumber: 1
zpe: 726833.2 jmol-1
zpe.correction: 0.276836 hartree
zpe.thermalcorrener: 0.302163 hartree
zpe.thermalcorrenthalpy: 0.303107 hartree
zpe.thermalcorrgfe: 0.218008 hartree
zpe.sumelectzpe: -2131.397521 hartree
zpe.sumelectthermal: -2131.372194 hartree
zpe.sumelectthermalent: -2131.371249 hartree
zpe.sumelectthermalfe: -2131.456349 hartree
dipole: 4.9097 -3.0816 -1.4200
dipole: 5.9680
quadrupole: -226.6168 -185.8378 -182.3688
quadrupole: 1.8927 14.1886 3.0125
quadrupole: -28.3423 12.4367 15.9057 1.8927 14.1886 3.0125
hfenergy: -2131.6743567 hartree
pointgroup: C01 [X(C20H12Cl1N1O6S1)]
dipole: -1.8815961 1.2838614 -0.5696066 debye
polarizability: 1027.9044098|-59.9954878|298.8070237|-14.766928|-4.8192816|164.3097075 unknown
InChI: InChI=1S/C20H12NO6S.Cl/c21-18-15(27-10-5-7-11(8-6-10)28(25)26)9-14(22)16-17(18)20(24)13-4-2-1-3-12(13)19(16)23;/h1-9,22H,21H2;
charge 0 multiplicity 1
41 atoms
Cl 7.30284 -2.44698 -0.59075
S  7.136103 -0.333412 0.617548
O  1.521248 1.238266 -0.928284
O  -0.96711 -2.973739 -0.591058
O  -3.231959 2.687477 0.125821
O  -3.527545 -2.829525 0.00021
O  7.194136 -0.669576 2.201072
O  8.162273 0.710137 -0.076277
N  -0.695133 2.646715 -0.364749
C  -2.06058 0.590569 -0.18203
C  -2.125253 -0.853542 -0.229461
C  -4.559776 0.698913 0.305674
C  -4.632256 -0.719739 0.270217
C  -0.814366 1.282322 -0.395633
C  -3.270049 1.396217 0.084211
C  -3.420581 -1.561825 0.008617
C  -0.934037 -1.582954 -0.512216
C  0.352219 0.486132 -0.650495
C  0.297905 -0.902063 -0.725021
C  -5.72928 1.46202 0.556846
C  -5.87655 -1.362496 0.487486
C  -6.961181 0.816215 0.770395
C  -7.034777 -0.601121 0.735726
C  2.801322 0.795256 -0.538837
C  3.024894 0.033117 0.635318
C  3.869675 1.237911 -1.35376
C  5.386161 0.133683 0.156351
C  4.343973 -0.312067 0.987947
C  5.190947 0.895808 -1.008923
H  1.204901 -1.4705 -0.963388
H  -5.640404 2.552231 0.577811
H  -5.902166 -2.456072 0.455593
H  -7.863439 1.406189 0.963361
H  -7.994143 -1.102583 0.902354
H  0.211117 3.074665 -0.544258
H  -1.564829 3.175001 -0.181957
H  2.189243 -0.2710 1.271481
H  3.652862 1.833937 -2.244187
H  -0.068147 -3.333708 -0.808697
H  4.556838 -0.886676 1.894599
H  6.040404 1.219997 -1.617459
