program: Gaussian 09
title: 000089125
version: EM64L-G09RevD.01
frameworkgroup: C1[X(C8H11NO3)]
method: RPBEPBE
basis: SDD
operation: Freq
keyword: #p
keyword: freq=noraman
keyword: PBEPBE/SDD
title: #p freq=noraman PBEPBE/SDD
converged: YES YES NO NO
title: Mulliken charges:
elementType: O O O N C C C C C C C C H H H H H H H H H H H
charge: -0.273954 -0.260953 -0.238387 -0.010426 -0.225331 -0.299859 -0.205546 -0.676536 0.217703 0.273357 -0.569383 -0.190057 0.191924 0.211692 0.222452 0.260797 0.196737 0.186699 0.203652 0.229322 0.231904 0.267176 0.257017
chargesum: 0.00000
title: Mulliken charges with hydrogens summed into heavy atoms:
elementType: O O O N C C C C C C C C
charge: -0.273954 -0.260953 -0.238387 -0.010426 0.178285 0.183390 0.177890 -0.011658 0.217703 0.273357 -0.045190 -0.190057
polarizability: 1.07201255e+02 6.84072400e+00 9.36508445e+01 1.62012937e+01 -1.00755761e+01 1.04139976e+02
1716.lowfreq: -12.0102 -2.1293 -0.0004 -0.0002 0.0007 9.7794 17.8982 24.8102 48.0454
frequency: 16.6207 24.7057 47.8774 64.4008 84.1626 117.2281 157.9618 169.7683 231.3623 236.9078 275.2986 302.7818 323.6624 401.2515 420.1789 468.5878 493.4678 517.1461 617.7490 714.5308 757.8309 770.1980 797.6467 815.5499 850.6023 923.8054 929.7228 1004.9006 1018.5540 1036.3310 1081.2218 1096.0123 1124.3288 1135.2598 1143.8401 1209.4133 1250.8257 1253.8187 1265.5517 1337.7250 1354.9080 1390.6753 1405.8681 1408.1036 1454.4155 1459.3915 1460.3327 1479.4223 1493.0161 1611.2083 1640.4896 2184.0580 2916.6898 2925.6149 2970.1895 2978.4563 2995.8197 3032.0063 3093.7076 3103.0946 3106.6331 3116.2232 3235.8561
redmass: 5.5359 4.7310 1.6817 6.7655 5.6748 5.0141 4.1147 3.4763 1.5188 2.1736 4.2472 3.4806 3.8249 3.3842 3.5586 3.8672 5.2533 3.8555 5.4661 2.5945 4.0241 1.9155 2.6864 1.1037 3.7343 2.1319 2.1108 2.4147 1.3661 2.6749 3.6729 2.4361 2.4134 2.1514 2.0867 1.1398 1.1458 1.1887 3.5108 1.2438 1.3837 1.2491 1.4579 1.2120 1.0884 1.0411 1.0867 1.0481 1.0794 6.0369 8.5130 12.6278 1.0567 1.0567 1.1060 1.1019 1.0359 1.0580 1.0991 1.1010 1.1080 1.0613 1.1172
irintensity: 2.1152 0.1163 3.7646 6.5125 1.5691 6.7646 4.1370 0.8777 2.3772 4.8026 1.5691 0.6689 17.2476 3.6159 0.4348 5.0839 0.7943 6.1299 2.8504 6.3226 8.0284 7.1712 7.2991 4.1341 10.1247 25.3460 3.4926 21.5840 56.5379 38.0163 118.0566 7.7928 153.9258 112.4561 92.0625 3.2784 0.7150 2.3762 115.9990 25.6588 4.8173 17.7920 7.1516 44.7127 17.5526 12.1921 15.3085 3.4902 5.8976 36.9819 131.3531 4.9188 27.3441 117.8669 74.3117 24.2773 20.2059 37.5733 33.8709 35.9768 10.5019 1.6026 0.1460
temp: 298.150 k
press: 1.00000 atm
elementType: 8 8 8 7 6 6 6 6 6 6 6 6 1 1 1 1 1 1 1 1 1 1 1
symmnumber: 1
zpe: 468367.7 jmol-1
zpe.correction: 0.178392 hartree
zpe.thermalcorrener: 0.192040 hartree
zpe.thermalcorrenthalpy: 0.192984 hartree
zpe.thermalcorrgfe: 0.135050 hartree
zpe.sumelectzpe: -590.893462 hartree
zpe.sumelectthermal: -590.879814 hartree
zpe.sumelectthermalent: -590.878870 hartree
zpe.sumelectthermalfe: -590.936804 hartree
dipole: -1.8277 -1.0451 0.1864
dipole: 2.1137
quadrupole: -58.0050 -75.6130 -72.2863
quadrupole: -3.1150 12.0810 11.4823
quadrupole: 10.6298 -6.9782 -3.6516 -3.1150 12.0810 11.4823
hfenergy: -591.0718539 hartree
pointgroup: C01 [X(C8H11N1O3)]
dipole: -0.680439 -0.4359203 0.196217 debye
dipolederiv: -0.8224194 0.2881464 0.1723411 0.3752394 -0.7131939 -0.1692136 0.2170246 -0.19683 -0.5063516 -1.1979253 -0.3213879 -0.4146506 -0.4193954 -0.5172422 -0.1295104 -0.5788045 -0.1195141 -0.6918861 -0.5445758 -0.1593185 -0.0133005 -0.0658958 -0.6338541 0.324785 -0.2157942 0.2033094 -0.7450379 -0.2176348 0.009593 0.0219545 -0.0175003 -0.2607861 0.0226635 0.0565849 0.0486517 -0.2440225 0.341589 -0.0109319 -0.11707 -0.1043293 0.4654613 0.1184501 -0.2821358 0.2469756 0.5076895 0.6797807 0.2199346 0.1303682 0.3679396 0.3750997 0.1651875 -0.0272994 0.0612562 0.1890726 0.7519706 -0.1954088 -0.09804 -0.2368479 0.576257 0.027246 -0.0008688 -0.0477245 0.2817566 0.0047267 0.035408 0.0424568 0.0536037 -0.0126686 -0.0870453 0.0463476 -0.08551 -0.0576523 1.2560452 0.5204947 0.3695826 0.479046 0.8873203 -0.2302096 0.7251485 -0.1165309 1.1118463 -0.1478066 -0.1352955 -0.0956224 -0.16565 -0.0147287 -0.0823867 -0.1020725 -0.0517598 0.0575879 -0.07147 0.1304053 0.0636948 0.0691261 -0.1042193 -0.0512704 0.1416689 0.0051714 -0.0701037 -0.0105537 -0.0716464 0.0069039 -0.0155584 0.0517064 -0.0255175 -0.071138 -0.0938424 0.103778 -0.1253306 -0.1596185 -0.0772717 -0.0518159 -0.108807 -0.097333 0.0359005 -0.0882151 0.0042144 0.0649066 0.0072364 0.0339809 0.0328692 -0.0443406 0.1207444 0.082236 0.018537 -0.1263491 -0.0386045 0.0168394 0.0201188 -0.0447466 -0.0300083 -0.10844 0.0388724 -0.1351208 -0.0043676 0.0593036 -0.0134678 -0.0324906 -0.0771757 0.0587195 0.0077354 0.0379923 0.1012726 0.0115515 -0.018196 -0.0020096 0.0886286 0.0450838 -0.0822426 0.0900909 -0.0012721 0.1472067 -0.1220202 -0.2008584 -0.0341636 -0.0442092 -0.1172276 -0.0804985 -0.0831442 -0.0936708 -0.0407896 0.0167955 -0.0761754 0.1425569 -0.0007427 0.1458159 -0.001836 -0.011305 -0.0180813 0.0063607 0.0771672 0.1064929 -0.0333001 0.018397 -0.0469748 -0.0078228 0.130773 0.0474679 0.0801935 -0.049805 -0.0397613 -0.1297268 -0.067498 -0.1031868 0.0311814 -0.0342319 -0.0258004 -0.0416426 0.0583041 0.1625842 -0.014244 -0.0040482 -0.0071715 0.1094984 0.0650336 -0.0070019 0.0599003 0.0744987 0.0839121 -0.0900953 -0.0034833 -0.0952476 0.0570047 0.0368982 -0.0053039 0.0386446 0.1233339 unknown
polarizability: 108.2709138|9.9749607|91.7580578|15.1321674|-7.5154465|104.9631036 unknown
InChI: InChI=1S/C8H11NO3/c1-3-11-4-5-12-8(10)7(2)6-9/h2-5H2,1H3
charge 0 multiplicity 1
23 atoms
O  -2.371782 -0.42075 0.192853
O  0.390482 -0.862333 -0.814758
O  1.242365 -1.481511 1.279299
N  2.031774 1.84549 -2.142653
C  -2.021703 -1.171598 -1.009197
C  -0.699984 -1.876865 -0.743141
C  -3.54397 0.449375 -0.000886
C  -3.796486 1.175815 1.318941
C  1.247945 -0.746423 0.267425
C  2.21352 0.392587 0.049693
C  3.158102 0.648338 1.001464
C  2.108766 1.181726 -1.151166
H  -2.799932 -1.934791 -1.241299
H  -1.921248 -0.497002 -1.887283
H  -0.47973 -2.619717 -1.528864
H  -0.689362 -2.351683 0.252869
H  -3.339498 1.17074 -0.822888
H  -4.424643 -0.16585 -0.29305
H  -4.667335 1.850131 1.2276
H  -3.995281 0.451352 2.127207
H  -2.915149 1.776435 1.601819
H  3.195828 0.021277 1.899002
H  3.877923 1.464756 0.893712
