program: Gaussian 09
title: 000089128
version: EM64L-G09RevD.01
frameworkgroup: C1[X(C11H22O2S)]
method: RPBEPBE
basis: SDD
operation: Freq
keyword: #p
keyword: freq=noraman
keyword: PBEPBE/SDD
title: #p freq=noraman PBEPBE/SDD
converged: NO YES NO NO
title: Mulliken charges:
elementType: S O O C C C C C C C C C C C H H H H H H H H H H H H H H H H H H H H H H
charge: -0.037697 -0.259890 -0.246293 -0.377428 -0.371574 -0.377675 -0.352551 -0.392797 -0.356581 -0.287518 -0.695550 0.265307 -0.447981 -0.682295 0.194854 0.194890 0.190506 0.190471 0.195130 0.195129 0.188502 0.188538 0.213397 0.213457 0.195280 0.195256 0.227516 0.227423 0.209912 0.216022 0.209915 0.261169 0.261181 0.274089 0.273511 0.104375
chargesum: 0.00000
title: Mulliken charges with hydrogens summed into heavy atoms:
elementType: S O O C C C C C C C C C C C
charge: 0.066678 -0.259890 -0.246293 0.012317 0.009403 0.012584 0.024490 0.034057 0.033956 0.167420 -0.059701 0.265307 0.074368 -0.134694
polarizability: 2.03487201e+02 -2.45208618e+00 1.28005096e+02 7.32570316e-03 1.04355891e-01 1.01921810e+02
1716.lowfreq: -0.0001 0.0012 0.0024 3.9794 5.1944 16.3756 18.0611 27.8555 29.6361
frequency: 17.9377 27.7086 29.6093 41.8442 48.8960 71.7465 76.4893 89.6100 106.4190 136.1776 136.5540 149.5713 162.8149 178.4363 185.9212 216.1197 230.7752 256.4823 307.0292 348.3983 416.3092 467.8421 497.1659 554.9031 637.1518 722.4554 728.6972 730.1180 752.5032 780.0359 792.1131 820.4987 859.1323 878.6844 891.2496 937.3303 937.9779 979.1867 995.7312 1010.3117 1022.8662 1048.1573 1077.3156 1079.6135 1087.0110 1091.6769 1126.4968 1136.6729 1138.0564 1150.2878 1188.1774 1220.8212 1223.4386 1257.5151 1258.4283 1264.0887 1271.0050 1276.7911 1283.8232 1295.6245 1297.8952 1302.9999 1335.7621 1343.9317 1355.6272 1358.7541 1376.0803 1391.4510 1445.3082 1460.6418 1462.3356 1463.5546 1467.6421 1469.6181 1475.2020 1477.8732 1481.1584 1487.1920 1490.2483 1634.7163 2440.9270 2951.9095 2953.7972 2956.9448 2963.9116 2969.3871 2973.0406 2986.3690 2991.0393 2994.4323 3001.5324 3003.7487 3006.4025 3023.0036 3037.6647 3047.5262 3050.1312 3054.3772 3069.4494 3071.8801 3076.1974 3126.6215
redmass: 3.0895 2.5996 5.1790 2.0416 4.4607 2.3267 4.8604 2.0511 2.3012 4.7085 1.9039 2.1074 5.0349 1.0641 2.8601 3.9966 1.1299 9.3527 3.4772 4.1159 3.2274 3.5081 3.5706 2.7316 7.4511 1.0616 4.2126 1.0800 1.1075 1.2636 1.1622 1.4364 1.2071 4.1920 2.1005 1.1996 4.3481 1.5227 4.5343 1.1142 3.6228 3.2040 2.4430 2.2653 2.4688 3.3126 2.9626 1.4303 2.1081 1.4493 1.6534 1.2866 1.3825 1.2930 1.2441 1.3017 1.1418 1.1143 1.0560 1.1149 1.0993 1.3230 1.3999 1.6192 1.6243 1.6353 1.6110 1.2184 1.0874 1.0937 1.0738 1.0738 1.0684 1.0818 1.0779 1.0421 1.0804 1.0874 1.0969 9.6109 1.0385 1.0590 1.0589 1.0592 1.0592 1.0587 1.0365 1.0969 1.0599 1.0992 1.0572 1.0601 1.1021 1.1041 1.1043 1.1046 1.0568 1.0996 1.1007 1.0993 1.1079 1.1094
irintensity: 0.0386 2.1949 0.0541 0.1565 0.4255 0.2666 0.4347 0.6046 0.2732 3.3803 1.0157 0.1337 0.0790 36.5507 5.5132 8.5343 0.0003 0.6373 9.8129 4.1107 3.8419 1.4908 1.6860 1.2827 14.0424 14.5207 11.7336 0.1541 4.4888 13.2584 0.4839 7.3463 0.5034 4.8643 10.2883 0.9451 43.8404 0.1480 3.0957 0.0545 4.4006 0.9892 0.7932 9.3168 72.9727 37.0263 6.9720 100.3353 262.4142 1.3072 0.0001 10.3162 0.1363 48.2850 0.0347 4.7387 0.2458 0.3014 0.5026 0.1145 0.0678 0.0274 15.9116 103.2232 1.7071 0.7480 2.0512 11.4820 24.7624 7.8016 0.0440 0.0525 0.5339 0.0282 2.9320 12.4855 0.4118 2.9935 33.5232 181.0805 36.9521 0.2211 1.7015 0.1656 17.3904 152.3697 36.7393 0.0657 17.6126 0.4551 38.4128 14.2760 1.3396 0.0035 74.4295 49.5570 13.8922 2.3468 88.8980 54.1579 84.7733 15.6305
temp: 298.150 k
press: 1.00000 atm
elementType: 16 8 8 6 6 6 6 6 6 6 6 6 6 6 1 1 1 1 1 1 1 1 1 1 1 1 1 1 1 1 1 1 1 1 1 1
symmnumber: 1
zpe: 813664.5 jmol-1
zpe.correction: 0.309908 hartree
zpe.thermalcorrener: 0.328872 hartree
zpe.thermalcorrenthalpy: 0.329817 hartree
zpe.thermalcorrgfe: 0.258342 hartree
zpe.sumelectzpe: -979.718197 hartree
zpe.sumelectthermal: -979.699233 hartree
zpe.sumelectthermalent: -979.698289 hartree
zpe.sumelectthermalfe: -979.769764 hartree
dipole: -1.9663 0.1093 0.0135
dipole: 1.9694
quadrupole: -96.2742 -103.6302 -94.1369
quadrupole: 3.4216 0.1086 0.0210
quadrupole: 1.7396 -5.6164 3.8769 3.4216 0.1086 0.0210
hfenergy: -980.0281054 hartree
pointgroup: C01 [X(C11H22O2S1)]
dipole: 0.7723176 0.0621157 -0.0023937 debye
polarizability: 203.3197394|4.3056079|128.1669883|0.3234149|0.3731996|101.9273791 unknown
InChI: InChI=1S/C11H22O2S/c1-2-3-4-5-6-7-9-13-11(12)8-10-14/h14H,2-10H2,1H3
charge 0 multiplicity 1
36 atoms
S  -7.323395 -1.302072 -0.041797
O  -2.269139 -0.242906 -0.009346
O  -3.627717 1.652418 0.024869
C  2.734798 -0.382848 0.001236
C  4.061559 0.409131 0.013886
C  1.483905 0.52437 0.011421
C  5.312817 -0.497571 0.004625
C  0.163291 -0.280974 -0.003799
C  6.641513 0.292417 0.015663
C  -1.058788 0.636383 0.008347
C  7.885489 -0.622008 0.00615
C  -3.503352 0.4053 0.001847
C  -4.635205 -0.611013 -0.017393
C  -6.009785 0.071549 -0.02209
H  2.706529 -1.036413 -0.895389
H  2.70349 -1.059781 0.880215
H  4.09005 1.063244 0.910468
H  4.093301 1.086282 -0.865337
H  1.517196 1.202165 -0.866895
H  1.51279 1.175919 0.909537
H  5.285572 -1.15327 -0.890964
H  5.283419 -1.173963 0.884581
H  0.122423 -0.952917 0.874923
H  0.126173 -0.925002 -0.903335
H  6.67018 0.968457 -0.863337
H  6.668131 0.946896 0.910912
H  -1.100253 1.269727 0.914059
H  -1.096056 1.299308 -0.876111
H  7.894779 -1.286796 0.890569
H  8.821862 -0.034426 0.015126
H  7.897759 -1.264304 -0.894729
H  -4.526212 -1.273914 0.862091
H  -4.510963 -1.258536 -0.906033
H  -6.144992 0.689161 0.878628
H  -6.132658 0.702649 -0.915242
H  -8.424612 -0.461563 -0.041154
