program: Gaussian 09
title: 000089112
version: EM64L-G09RevD.01
frameworkgroup: C1[X(C7H6N2O3S2)]
method: RPBEPBE
basis: SDD
operation: Freq
keyword: #p
keyword: freq=noraman
keyword: PBEPBE/SDD
title: #p freq=noraman PBEPBE/SDD
converged: YES YES NO NO
title: Mulliken charges:
elementType: S S O O O N N C C C C C C C H H H H H H
charge: 0.989479 0.243956 -0.567837 -0.504083 -0.506146 -0.035225 -0.558179 -0.091984 -0.313065 0.385172 -0.271964 -0.215085 -0.307390 -0.163652 0.295598 0.284021 0.269401 0.381547 0.339089 0.346347
chargesum: 0.00000
title: Mulliken charges with hydrogens summed into heavy atoms:
elementType: S S O O O N N C C C C C C C
charge: 0.989479 0.243956 -0.186290 -0.504083 -0.506146 -0.035225 0.127257 -0.091984 -0.313065 0.385172 0.023634 0.068936 -0.037989 -0.163652
polarizability: 2.42961877e+02 -6.62298638e+00 1.38078556e+02 1.16523476e+00 2.65563399e-01 7.20660486e+01
1716.lowfreq: -2.8403 0.0004 0.0018 0.0028 5.1251 6.9770 31.2521 61.7631 109.0910
frequency: 31.2203 61.7616 109.0874 131.4679 164.7556 190.2875 205.5128 227.7394 235.4967 291.4063 314.9324 343.2636 346.9961 390.8357 407.8263 419.5370 434.3176 479.8146 497.9951 516.2449 542.6257 563.2550 583.0049 600.7077 657.0870 704.2696 744.4928 827.2562 836.9078 844.3289 892.5379 965.8357 969.7562 1027.8333 1044.6980 1053.3912 1057.3492 1129.8217 1240.3983 1252.6397 1302.7167 1368.6325 1408.0439 1449.1277 1558.8719 1565.0413 1600.1017 1646.1120 3162.8310 3166.1652 3184.5063 3479.1767 3548.7945 3699.0064
redmass: 7.9212 6.5863 8.7274 6.5381 1.8541 4.6806 6.1377 6.5025 4.0748 3.8668 8.2134 1.5753 5.7822 2.9303 10.0090 7.5605 2.9611 1.3264 8.1320 7.5505 6.9214 5.1516 5.2486 5.6777 6.8926 9.2827 4.0324 9.2444 1.4879 6.8758 1.3796 6.2012 1.5853 3.5313 1.4379 1.6548 3.1249 1.2913 1.5221 2.3610 3.5946 3.4014 4.3530 4.3944 6.6894 4.3650 1.7469 3.3884 1.0895 1.0935 1.0969 1.0661 1.0455 1.1046
irintensity: 1.7521 1.1201 0.3097 1.7426 45.3906 11.5846 14.2169 10.7413 7.2676 69.8562 11.3679 18.8475 11.8442 33.0002 92.7318 1.1661 2.1548 271.0036 1.7662 20.7474 114.0653 2.5958 100.3344 4.1238 18.7450 4.7557 1.0189 54.9822 44.0543 44.3153 19.5769 79.0647 11.9940 4.8552 35.8656 32.7127 104.3378 28.7174 10.1404 112.5605 47.8565 0.5112 18.7894 78.8932 15.1270 265.5541 45.6527 568.9871 1.8542 6.7276 2.9522 41.8718 204.8202 56.8500
temp: 298.150 k
press: 1.00000 atm
elementType: 16 16 8 8 8 7 7 6 6 6 6 6 6 6 1 1 1 1 1 1
symmnumber: 1
zpe: 331831.1 jmol-1
zpe.correction: 0.126388 hartree
zpe.thermalcorrener: 0.140111 hartree
zpe.thermalcorrenthalpy: 0.141055 hartree
zpe.thermalcorrgfe: 0.085556 hartree
zpe.sumelectzpe: -1400.462731 hartree
zpe.sumelectthermal: -1400.449007 hartree
zpe.sumelectthermalent: -1400.448063 hartree
zpe.sumelectthermalfe: -1400.503562 hartree
dipole: 7.1819 -0.0896 1.4576
dipole: 7.3289
quadrupole: -71.4453 -95.5652 -101.7695
quadrupole: -4.1404 -8.9894 -1.4625
quadrupole: 18.1480 -5.9718 -12.1762 -4.1404 -8.9894 -1.4625
hfenergy: -1400.5891183 hartree
pointgroup: C01 [X(C7H6N2O3S2)]
dipole: -2.8263426 0.1980909 0.5353562 debye
dipolederiv: 2.4205906 0.0312183 0.0999348 0.2337875 1.2024648 0.0026405 0.2910588 0.0152905 1.6492506 -0.4841992 -0.0523004 0.0004041 -0.1296514 -0.4040972 -0.0041349 0.0060742 -0.0041095 0.0773941 -0.6292173 0.0366268 -0.2449338 -0.0057835 -0.5405317 -0.0251377 -0.4007425 -0.0222972 -0.9936402 -0.8145686 0.058896 0.0463783 0.0836137 -0.5561098 -0.1131898 0.0033193 -0.0347859 -0.5199022 -0.7431079 -0.0479681 -0.0037372 -0.1572891 -0.6106833 0.1158457 -0.0135911 0.0298519 -0.5081622 -1.4909694 0.2372372 0.0022039 0.7044955 -0.8647399 -0.0079709 0.0163575 -0.0085627 -0.2364708 -1.9802871 0.221777 0.0030675 0.1605799 -0.2577626 0.0042233 0.012191 0.0023326 -0.6794807 -0.5099593 0.0374969 0.0127663 -0.0284528 -0.0549189 0.0030379 0.2017139 0.0144401 -0.1726206 0.0544357 -0.3229474 -0.0063401 -0.6839127 0.0791962 0.0001231 -0.023632 0.003236 -0.0909236 1.2237222 -0.1392205 -0.0023617 0.2080768 0.0420275 0.0013327 -0.0074374 0.0010187 0.0814347 0.1158386 0.107821 -0.0033952 -0.2332204 -0.0627459 -0.0017849 -0.0239831 -0.0158368 -0.045237 -0.0281824 -0.1101894 -0.0064687 0.2849651 -0.0155321 0.0001864 -0.0227371 0.0163249 -0.0937427 -0.2959142 0.0911609 -0.0037216 0.1550635 0.0677825 0.0023263 -0.01125 -0.0010843 -0.1389584 2.1940868 -0.0526089 -0.0077387 -0.5436285 1.1300613 0.0109544 -0.0216859 0.0118645 0.1124178 0.1502526 -0.0217008 0.0074694 -0.0071454 0.0767006 -0.0017795 0.0048592 0.0081523 0.1610126 0.0917404 0.0710323 0.0077542 0.0393263 0.0923533 0.0027195 0.0081346 -0.0095301 0.1591331 0.0343649 -0.0546145 -0.0002586 -0.0308198 -0.0090338 -0.0036316 0.0089697 -0.0027204 0.1727794 0.095924 -0.0460655 0.0963688 -0.0399548 0.3410501 0.0190303 -0.0287152 0.00079 0.2618652 0.303623 -0.0547607 0.0009219 -0.1304088 0.1757501 -0.0021961 -0.0001041 -0.0017395 0.4011963 0.2918267 0.0091095 0.0016862 0.1203589 0.1687687 -0.0025947 0.0012 -0.0026349 0.4026546 unknown
polarizability: 241.7383078|-13.0763298|139.2824519|1.0938922|1.1236131|72.0857221 unknown
InChI: InChI=1S/C7H6N2O3S2/c8-7-9-5-2-1-4(14(10,11)12)3-6(5)13-7/h1-3,10H,8H2
charge 0 multiplicity 1
20 atoms
S  3.069984 0.15023 -0.07065
S  -2.386334 1.759677 0.011701
O  3.317351 0.128238 1.774097
O  3.884611 -1.097505 -0.701776
O  3.331218 1.658344 -0.599238
N  -2.866253 -0.917765 -0.015436
N  -4.845972 0.413023 0.015048
C  1.244971 -0.207775 -0.037985
C  -0.99366 0.593379 -0.011799
C  -1.474009 -0.764999 -0.022845
C  0.374332 0.897446 -0.015132
C  0.834283 -1.555664 -0.052476
C  -0.545357 -1.834345 -0.048594
C  -3.488584 0.24839 0.002542
H  0.767093 1.918223 -0.018362
H  1.578043 -2.35732 -0.08284
H  -0.916624 -2.862108 -0.062416
H  4.291951 0.282935 1.946213
H  -5.278459 1.332188 0.027786
H  -5.431184 -0.420692 0.010662
