program: Gaussian 09
title: 000089136
version: EM64L-G09RevD.01
frameworkgroup: C1[X(C10H25NO5P2S2)]
method: RPBEPBE
basis: SDD
operation: Freq
keyword: #p
keyword: freq=noraman
keyword: PBEPBE/SDD
title: #p freq=noraman PBEPBE/SDD
converged: NO YES NO NO
title: Mulliken charges:
elementType: S S P P O O O O O N C C C C C C C C C C H H H H H H H H H H H H H H H H H H H H H H H H H
charge: 0.022442 -0.228354 1.399955 0.612353 -0.520692 -0.529608 -0.653312 -0.474699 -0.462477 -0.724271 0.045812 0.033224 -0.288912 -0.655480 -0.663667 -0.705021 -0.669894 -0.667540 -0.517789 -0.475799 0.235518 0.218646 0.343393 0.242558 0.265314 0.332342 0.262011 0.223883 0.206696 0.237693 0.212483 0.198973 0.289545 0.266046 0.206752 0.215697 0.223943 0.206799 0.229068 0.311568 0.241085 0.226899 0.246345 0.236053 0.244422
chargesum: 0.00000
title: Mulliken charges with hydrogens summed into heavy atoms:
elementType: S S P P O O O O O N C C C C C C C C C C
charge: 0.022442 -0.228354 1.399955 0.612353 -0.520692 -0.529608 -0.653312 -0.474699 -0.462477 -0.380879 0.281330 0.251870 0.218960 -0.061127 0.004605 -0.004020 0.018601 -0.007730 0.261762 0.251021
polarizability: 2.79391313e+02 9.49439161e+00 2.01236972e+02 1.75535859e+01 7.21352368e+00 1.96032608e+02
1716.lowfreq: -6.3883 -0.0021 0.0010 0.0020 1.6764 5.4782 12.8508 14.9578 32.7428
frequency: 10.2432 13.7567 32.6285 36.5854 43.2282 45.9102 54.3005 64.7942 69.3550 82.1266 88.7415 108.0431 130.6421 135.3822 140.7616 149.0118 164.1261 172.4240 178.1279 188.0669 192.4707 195.1975 200.0837 212.7734 233.6536 239.2629 244.8489 254.5689 278.5992 290.7144 314.3651 340.6941 344.3216 350.0017 361.7590 382.7766 386.6910 414.4859 429.2645 432.6415 446.5706 480.7183 499.5801 529.7779 639.6708 650.2608 666.9586 680.0926 688.5017 731.0676 794.1649 827.7116 835.3009 903.3796 911.0403 928.4307 933.5627 937.5572 939.8005 946.9289 978.6732 993.8699 1023.2989 1032.6422 1092.5351 1094.2225 1106.3938 1114.7388 1122.1051 1127.1590 1153.1332 1153.4418 1156.2997 1167.7410 1181.4336 1182.0924 1239.5583 1284.0143 1322.8605 1329.5586 1331.2064 1336.0463 1342.2799 1377.9413 1382.6208 1391.0362 1392.8716 1398.1859 1421.6594 1434.6331 1442.5184 1453.7700 1454.2972 1457.2791 1463.0216 1464.1156 1465.5825 1468.9790 1470.5034 1471.1368 1472.3777 1475.5920 1488.5592 1491.5760 2977.4771 2979.4264 2983.2436 2983.9301 2984.4930 2986.7627 2991.7914 3010.8284 3019.3665 3028.1107 3077.9259 3079.3573 3080.4392 3085.0548 3086.3988 3088.8196 3091.6291 3095.1314 3098.2741 3101.8100 3102.4525 3111.7492 3118.7030 3129.0797 3554.7286
redmass: 3.2088 3.8687 4.1432 3.6356 3.7623 5.4116 4.5869 3.5701 3.7941 3.5613 5.6529 5.5396 5.3437 1.9558 1.9790 4.1404 3.1691 2.7350 1.6853 2.2709 1.1502 1.2198 2.1185 4.0825 1.6834 2.6129 2.0075 1.3349 6.4281 2.9343 3.3213 4.1973 3.8013 3.5317 6.1775 2.8967 5.3260 2.8297 3.1427 3.0905 2.1084 2.9056 4.1361 16.5527 4.7221 9.6081 5.2110 5.1858 9.2577 1.6842 2.3754 5.8610 4.8076 2.9324 3.0187 1.2389 1.2713 1.3479 1.3148 10.7756 10.9859 1.8934 5.0993 3.6151 3.3627 1.6293 1.8371 1.2501 1.2334 1.2954 1.5440 1.6348 1.9543 1.2716 1.9352 1.9019 1.1939 1.1415 1.2210 1.2323 1.4136 1.4504 1.2303 1.2580 1.2487 1.2371 1.2256 1.2173 1.1192 1.1054 1.0753 1.0499 1.0482 1.0504 1.0552 1.0475 1.0468 1.0683 1.0508 1.0521 1.0525 1.0544 1.0480 1.0484 1.0303 1.0283 1.0354 1.0358 1.0843 1.0356 1.0369 1.0867 1.0632 1.0592 1.1050 1.0991 1.0987 1.0990 1.1004 1.1041 1.0989 1.1005 1.1013 1.1013 1.1008 1.1073 1.1071 1.1021 1.0764
irintensity: 0.8384 0.1302 0.1649 0.2872 0.5820 0.1373 0.4320 1.4761 1.2993 4.8233 4.6638 1.1701 3.0486 1.4157 2.5204 9.3089 5.4994 1.4218 0.8263 0.4840 2.0970 0.6320 3.8618 1.7822 9.7145 3.0055 12.0613 1.9517 5.2877 8.0564 4.6256 2.1046 7.9510 12.3169 19.9777 16.3453 21.4363 14.3449 9.9329 48.5273 52.9804 50.5941 53.0650 113.6175 15.7899 54.3570 23.3123 166.8875 66.6483 58.5430 13.1105 377.8386 175.9884 117.7096 86.3661 1.2257 5.7784 0.3638 1.2835 233.2430 20.3490 21.4632 12.9777 84.3024 128.7698 101.9806 14.5109 0.0115 1.0686 1.6614 7.7169 5.6983 30.1714 6.6668 18.7543 12.2740 7.6868 28.0327 22.3282 7.4585 8.4138 4.4192 2.4042 29.2405 25.7930 43.9429 21.2781 22.9202 4.7687 11.3197 5.6978 6.3875 13.0837 6.0588 15.5896 5.2858 2.7954 12.7945 1.2315 20.2620 3.7936 12.3284 19.9835 12.7162 49.2839 36.7370 14.7896 16.6418 17.0024 34.2373 26.3182 7.1664 25.9565 9.8348 18.1750 6.1091 16.6729 42.8389 1.3675 31.0054 44.3407 21.2080 10.3667 16.4822 36.7218 4.6978 7.9985 9.6600 28.8812
temp: 298.150 k
press: 1.00000 atm
elementType: 16 16 15 15 8 8 8 8 8 7 6 6 6 6 6 6 6 6 6 6 1 1 1 1 1 1 1 1 1 1 1 1 1 1 1 1 1 1 1 1 1 1 1 1 1
symmnumber: 1
zpe: 939242.3 jmol-1
zpe.correction: 0.357738 hartree
zpe.thermalcorrener: 0.386861 hartree
zpe.thermalcorrenthalpy: 0.387805 hartree
zpe.thermalcorrgfe: 0.294111 hartree
zpe.sumelectzpe: -2303.838826 hartree
zpe.sumelectthermal: -2303.809704 hartree
zpe.sumelectthermalent: -2303.808760 hartree
zpe.sumelectthermalfe: -2303.902454 hartree
dipole: -3.2395 0.0253 -2.5380
dipole: 4.1154
quadrupole: -153.4712 -145.1599 -148.6931
quadrupole: 11.7614 -8.6770 2.3204
quadrupole: -4.3632 3.9482 0.4150 11.7614 -8.6770 2.3204
hfenergy: -2304.1965647 hartree
pointgroup: C01 [X(C10H25N1O5P2S2)]
dipole: 1.2688911 0.3471582 -0.9439126 debye
polarizability: 279.4878491|14.3632698|205.1231177|-13.7388738|-3.3893845|192.0499263 unknown
InChI: InChI=1S/C8H19NO3PS.C2H6O2PS/c1-7(2)11-13(10,9-5-6-14)12-8(3)4;1-3-5(6)4-2/h7-9H,5-6H2,1-4H3;1-2H3
charge 0 multiplicity 1
45 atoms
S  -3.05715 2.340097 -0.233138
S  -5.175372 -0.028993 1.60978
P  1.674858 0.340326 0.138735
P  -3.481051 0.183219 0.455952
O  0.988749 -0.62671 -1.111548
O  3.331601 0.45357 -0.353788
O  1.387404 -0.167204 1.625601
O  -1.954443 -0.3771 1.04424
O  -3.355409 -0.729333 -1.024649
N  1.123187 1.935129 -0.205125
C  0.80643 -2.110421 -0.891277
C  4.35704 0.875475 0.672753
C  -0.229489 2.375923 0.183674
C  -1.288724 2.048574 -0.893044
C  2.131334 -2.833632 -1.170943
C  -0.333777 -2.503314 -1.83313
C  4.77314 -0.337453 1.516299
C  5.497545 1.479524 -0.150665
C  -1.72504 -0.459288 2.510377
C  -4.483132 -0.605099 -1.974817
H  0.499306 -2.24714 0.163873
H  3.894489 1.647258 1.321798
H  1.613463 2.442545 -0.94471
H  -0.209785 3.46005 0.396589
H  -0.492008 1.862148 1.123479
H  -1.21144 0.995358 -1.209489
H  -1.204738 2.695055 -1.783816
H  2.460665 -2.642776 -2.207306
H  2.001276 -3.923597 -1.036104
H  2.927148 -2.4920 -0.485751
H  -0.056284 -2.29087 -2.881248
H  -0.537991 -3.586254 -1.738643
H  -1.253041 -1.948713 -1.580242
H  3.908409 -0.737448 2.072489
H  5.551906 -0.041136 2.243795
H  5.186962 -1.130072 0.867468
H  5.144949 2.342291 -0.741185
H  6.310652 1.817363 0.517716
H  5.905437 0.724699 -0.845475
H  -0.632256 -0.575103 2.584313
H  -2.265583 -1.327251 2.924221
H  -2.053185 0.464231 3.021823
H  -4.217336 -1.273304 -2.80702
H  -4.578723 0.43613 -2.334913
H  -5.427391 -0.933957 -1.504046
