program: Gaussian 09
title: 000089107
version: EM64L-G09RevD.01
frameworkgroup: C1[X(C12H13ClF3NO)]
method: RPBEPBE
basis: SDD
operation: Freq
keyword: #p
keyword: freq=noraman
keyword: PBEPBE/SDD
title: #p freq=noraman PBEPBE/SDD
converged: YES YES NO NO
title: Mulliken charges:
elementType: Cl F F F O N C C C C C C C C C C C C H H H H H H H H H H H H H
charge: 0.001780 -0.162128 -0.156509 -0.156339 -0.486359 -0.217886 0.175869 -0.453261 -0.454962 -0.488178 -0.487599 0.460182 -0.530871 -0.402500 0.402054 -0.223007 -0.282498 0.254543 0.239124 0.204185 0.205199 0.238945 0.239579 0.205278 0.204006 0.239974 0.255329 0.343267 0.334205 0.237545 0.261033
chargesum: 0.00000
title: Mulliken charges with hydrogens summed into heavy atoms:
elementType: Cl F F F O N C C C C C C C C C C C C
charge: 0.001780 -0.162128 -0.156509 -0.156339 -0.143093 0.037443 0.175869 -0.009952 -0.010818 -0.043322 -0.043618 0.460182 -0.196666 -0.164955 0.402054 0.038026 -0.282498 0.254543
polarizability: 2.06444741e+02 9.42305425e+00 1.39620196e+02 -3.17194449e-03 2.03974381e-02 9.93689561e+01
1716.lowfreq: -0.0027 -0.0025 -0.0020 1.6314 3.2171 9.5729 23.7508 40.5461 66.8686
frequency: 23.6784 40.2172 66.8475 79.9781 123.1367 136.9436 166.1341 175.8985 188.9402 216.1275 233.8645 271.7914 287.3035 305.9661 318.3014 340.0616 358.5161 397.4506 416.4910 433.5142 451.8380 476.5471 494.5539 507.4040 521.3917 563.9022 595.4181 615.3707 634.7868 672.9982 690.7087 730.6896 756.5452 781.7347 829.5561 846.6068 890.9320 904.2143 941.8044 951.8875 966.9386 970.8103 994.6799 1001.5037 1001.5237 1013.2480 1025.8590 1075.3572 1094.3444 1128.4168 1135.8427 1151.6725 1159.4422 1166.3715 1237.1929 1243.8519 1250.7615 1264.3154 1284.8548 1314.0023 1314.8601 1336.8249 1351.5960 1361.9731 1379.0166 1400.4415 1430.2767 1442.3765 1447.4788 1463.7085 1465.8406 1467.2759 1583.2177 1608.5176 2955.5012 2960.6891 2984.4654 2988.4956 3049.6253 3052.4538 3055.6208 3058.7399 3135.7099 3173.6867 3199.5286 3445.5334 3579.0931
redmass: 5.2332 10.9197 7.3064 5.2903 5.5853 7.7442 4.6547 7.0742 1.2451 6.5019 1.8115 8.0799 11.1244 5.8666 2.6989 4.3435 2.1560 6.0492 3.0844 5.5226 5.9027 5.2477 3.5976 4.6867 3.0407 2.4962 2.2183 12.3074 5.3464 4.8386 3.6604 4.1905 6.6254 1.5446 1.3957 2.4158 3.7520 2.2393 2.8255 1.5468 1.4480 1.5964 2.3888 4.6483 5.5611 4.3914 3.6980 3.4530 2.4497 2.5865 1.4831 1.8947 1.4859 2.0872 1.3800 1.9855 1.4591 1.4290 1.8162 1.4463 1.3203 1.2618 1.6210 1.3424 9.9022 3.7994 1.1021 1.1207 1.1344 1.1021 1.1638 2.3629 7.4135 6.8717 1.0688 1.0688 1.0600 1.0605 1.0953 1.0958 1.1008 1.1016 1.0894 1.0953 1.0910 1.0749 1.0654
irintensity: 0.1999 0.3950 0.1170 1.5667 0.6283 1.8955 4.1446 3.6940 113.9144 0.3010 13.5681 4.9672 0.2774 1.2007 5.9478 4.0060 20.5594 3.2791 0.1312 0.1020 11.0157 34.2027 0.0289 13.2062 3.2040 63.2657 120.6998 14.4447 8.4766 37.9442 9.6984 0.7542 0.8926 1.0203 35.7985 10.1425 115.0357 11.2664 10.4208 23.3561 3.5091 65.3627 3.8653 115.5479 147.2949 26.0731 42.1220 140.5122 0.2545 22.6537 14.2492 15.8545 15.5891 23.4073 5.6554 122.8015 78.8315 43.9609 101.2693 1.3317 0.3717 4.6078 50.2797 0.1246 5.1179 17.9709 12.4531 6.0739 0.0383 14.1569 47.3338 55.4056 11.2577 10.0437 39.2470 53.3613 13.1831 28.7569 60.4711 6.8314 2.1196 57.0713 12.8818 2.1449 9.4186 0.6520 3.4408
temp: 298.150 k
press: 1.00000 atm
elementType: 17 9 9 9 8 7 6 6 6 6 6 6 6 6 6 6 6 6 1 1 1 1 1 1 1 1 1 1 1 1 1
symmnumber: 1
zpe: 607784.2 jmol-1
zpe.correction: 0.231493 hartree
zpe.thermalcorrener: 0.248395 hartree
zpe.thermalcorrenthalpy: 0.249340 hartree
zpe.thermalcorrgfe: 0.186157 hartree
zpe.sumelectzpe: -1353.277891 hartree
zpe.sumelectthermal: -1353.260989 hartree
zpe.sumelectthermalent: -1353.260044 hartree
zpe.sumelectthermalfe: -1353.323227 hartree
dipole: -5.9363 3.3711 0.0455
dipole: 6.8269
quadrupole: -123.6303 -107.1068 -111.2467
quadrupole: -0.0012 -0.0780 -0.0497
quadrupole: -9.6357 6.8878 2.7479 -0.0012 -0.0780 -0.0497
hfenergy: -1353.5093841 hartree
pointgroup: C01 [X(C12H13Cl1F3N1O1)]
dipole: 2.3578793 0.914489 -0.9045163 debye
polarizability: 205.0817966|-14.4570506|128.2360801|-1.4711353|-18.2979597|112.1160165 unknown
InChI: InChI=1S/C12H13ClF3NO/c13-10-2-1-8(7-9(10)12(14,15)16)11(18)3-5-17-6-4-11/h1-2,7,17-18H,3-6H2
charge 0 multiplicity 1
31 atoms
Cl -3.867753 1.853103 -0.757023
F  -2.619024 -1.858086 1.653964
F  -3.820481 0.045169 1.870566
F  -4.030166 -1.226608 0.003776
O  1.776167 -1.437406 0.925537
N  4.847809 -0.029904 -0.412092
C  1.892443 -0.235565 0.066271
C  2.774184 0.831246 0.78661
C  2.539496 -0.634914 -1.2963
C  4.256924 0.373149 0.884802
C  4.03108 -1.039616 -1.122652
C  0.458076 0.265834 -0.125982
C  -0.631244 -0.414971 0.459874
C  0.195525 1.423466 -0.898985
C  -1.960983 0.037185 0.288505
C  -1.122393 1.88961 -1.080245
C  -2.195065 1.198256 -0.487384
C  -3.084302 -0.730714 0.937828
H  2.353948 1.013775 1.793601
H  2.728212 1.785906 0.227255
H  2.47644 0.219264 -1.998284
H  1.956539 -1.468351 -1.731856
H  4.871457 1.180037 1.321851
H  4.340462 -0.487417 1.581702
H  4.099594 -1.994475 -0.559056
H  4.484358 -1.236195 -2.110408
H  5.064991 0.780872 -1.007053
H  2.677961 -1.815949 1.075103
H  -0.430289 -1.307097 1.05534
H  1.014679 1.978213 -1.370323
H  -1.321946 2.783783 -1.67694
