program: Gaussian 09
title: 000089084
version: EM64L-G09RevD.01
frameworkgroup: C1[X(C8H14O3)]
method: RPBEPBE
basis: SDD
operation: Freq
keyword: #pfreq=noraman
keyword: PBEPBE/SDD
title: #p freq=noraman PBEPBE/SDD
converged: YES YES NO NO
title: Mulliken charges:
elementType: O O O C C C C C C C C H H H H H H H H H H H H H H
charge: -0.274804 -0.259508 -0.219961 0.036800 -0.515635 -0.495939 0.261336 -0.682634 -0.684343 0.240115 -0.766469 0.231565 0.279913 0.252159 0.236513 0.275941 0.212887 0.252600 0.221585 0.208303 0.230847 0.225188 0.257678 0.239758 0.236106
chargesum: 0.00000
title: Mulliken charges with hydrogens summed into heavy atoms:
elementType: O O O C C C C C C C C
charge: -0.274804 -0.259508 -0.219961 0.268364 0.016437 0.016516 0.261336 0.004438 -0.020004 0.240115 -0.032928
polarizability: 1.26466352e+02 -2.68377525e+00 8.48638032e+01 1.11575557e+00 -3.78333160e+00 8.00467112e+01
1716.lowfreq: -11.4708 -4.6112 -0.0003 0.0002 0.0007 3.3504 28.7439 33.7015 60.0163
frequency: 28.6567 33.4041 59.9789 67.9922 107.8651 111.2834 125.4478 182.3575 193.6490 225.2777 240.3754 293.8375 355.1766 386.4928 425.3787 459.6138 484.2003 548.4443 591.6778 669.2035 756.2685 772.4791 826.8870 885.9826 919.6779 926.6225 928.6464 941.9960 970.1113 1054.4053 1081.5175 1097.4330 1139.2724 1157.5357 1164.7402 1181.0406 1185.9618 1238.8870 1304.0722 1325.8454 1334.2396 1360.3123 1370.9278 1380.8039 1396.8879 1436.3059 1443.5594 1448.8691 1456.4494 1456.6865 1465.3235 1472.3274 1487.2519 1626.0998 1636.8366 2967.5015 2981.3997 2989.2509 2991.1278 2992.9610 3026.6832 3029.4168 3066.7329 3075.5594 3084.4246 3093.0370 3098.0705 3103.9895 3122.0835
redmass: 3.5906 3.7294 3.9940 3.7728 1.2331 3.1735 1.9323 1.1019 2.2986 3.1952 1.3427 4.3254 2.6670 3.2661 2.5531 2.1655 2.6808 3.3516 4.0341 4.5756 2.0324 2.3517 3.3762 2.7677 2.7463 1.2253 1.6165 1.4027 2.2575 1.9584 3.1516 1.9125 2.2121 1.9873 1.5711 1.9446 1.9008 1.2616 1.3890 1.5530 1.3954 1.9144 1.2563 1.2615 1.2311 1.0867 1.0685 1.0880 1.0575 1.0521 1.0472 1.0500 1.0481 9.5486 7.5599 1.0631 1.0388 1.0357 1.0654 1.0361 1.0865 1.0936 1.0951 1.0945 1.0993 1.0987 1.1007 1.1007 1.1004
irintensity: 0.7641 4.6377 2.2654 2.2075 1.5947 3.6295 1.0781 1.5856 16.3529 0.0271 3.8795 5.1413 2.9960 8.7202 1.2334 1.1351 14.7996 14.9935 1.2483 1.0459 7.1221 8.8365 13.1636 1.7204 32.3006 1.6525 19.0125 0.9190 7.2399 7.0254 4.3025 217.1172 202.6327 11.8584 95.2014 2.0417 2.1023 112.5890 119.4074 37.2375 4.2616 10.8502 61.4922 33.6484 15.4842 15.2961 25.4401 54.0884 9.7882 12.3419 4.3276 5.4634 20.7334 191.1692 66.9524 20.2292 5.7306 16.3371 34.2777 17.7426 6.0246 11.6055 11.2157 10.3558 5.5344 51.2590 21.6151 31.6891 13.5070
temp: 298.150 k
press: 1.00000 atm
elementType: 8 8 8 6 6 6 6 6 6 6 6 1 1 1 1 1 1 1 1 1 1 1 1 1 1
symmnumber: 1
zpe: 543372.7 jmol-1
zpe.correction: 0.206960 hartree
zpe.thermalcorrener: 0.220671 hartree
zpe.thermalcorrenthalpy: 0.221615 hartree
zpe.thermalcorrgfe: 0.164802 hartree
zpe.sumelectzpe: -538.049943 hartree
zpe.sumelectthermal: -538.036232 hartree
zpe.sumelectthermalent: -538.035287 hartree
zpe.sumelectthermalfe: -538.092101 hartree
dipole: 0.9967 0.3842 -2.3000
dipole: 2.5360
quadrupole: -54.3466 -73.3543 -66.9226
quadrupole: -6.2656 8.2385 2.3430
quadrupole: 10.5279 -8.4798 -2.0481 -6.2656 8.2385 2.3430
hfenergy: -538.2569027 hartree
pointgroup: C01 [X(C8H14O3)]
dipole: 0.4135345 -0.2263874 0.8793172 debye
dipolederiv: -1.7621989 -0.319104 0.0077325 -0.3761628 -0.5603986 -0.0685596 -0.0899567 -0.0915816 -0.3600701 -0.7888013 0.0815705 0.0320442 -0.268819 -0.906195 -0.0867167 -0.0221962 -0.0953387 -0.3212733 -0.7104203 0.0168664 -0.0180415 0.0268681 -0.5944765 0.2910099 -0.0478588 0.283938 -0.5682848 0.990072 0.0772962 -0.0201916 -0.1700376 0.2194903 0.0116121 -0.0387683 0.0387888 0.4320632 -0.3667422 0.0923541 0.0153663 0.2404445 -0.0898362 0.024625 -0.1284663 0.0700148 0.0845159 -0.409544 0.1140447 -0.0982427 0.3435108 -0.1069576 0.1138164 -0.1250028 0.0792411 0.0760155 1.8360005 0.1207257 -0.0147007 0.5741701 1.1793889 0.1305121 0.1548147 0.1522841 0.1974812 -0.1002312 -0.0359126 -0.0001975 0.035028 0.0559438 -0.0307546 0.0254407 -0.0635333 -0.1741469 -0.0878014 -0.0587605 -0.0326332 -0.0347377 0.0334498 -0.0724792 -0.0553313 -0.0692045 -0.0380721 1.2479166 -0.0053401 -0.014496 -0.0511658 0.559253 -0.4517878 0.0339638 -0.4390438 0.5129526 -0.4446059 -0.1519284 0.1735828 -0.1334199 -0.0348215 0.0882579 0.2118169 0.1216351 -0.1110316 -0.0121324 -0.0491105 0.0218539 0.0606412 -0.0711308 0.0675432 0.0165314 0.0502889 -0.0038924 0.1819961 0.0212548 0.0000509 -0.0669604 0.0977681 0.0341742 0.0939115 0.0359148 -0.0027189 0.0438129 -0.0273408 -0.0151099 -0.0595788 0.0041603 -0.0790247 0.0208568 -0.1037933 0.0303512 0.0315654 -0.008082 0.0381818 -0.0742869 0.1000845 0.0239702 0.0534508 0.0553224 -0.1048483 0.1825188 0.0028313 -0.0243852 -0.1050526 0.0049159 -0.050238 -0.0286658 -0.0587437 0.0757691 -0.1490051 0.0862141 0.0399579 0.094551 0.0771653 -0.0020576 0.0461719 0.0154736 0.0847102 0.0372167 -0.0865464 -0.0957057 -0.0816743 0.0292339 -0.0691281 -0.0751637 -0.0487686 0.0181789 0.1151383 0.0170146 0.0038898 -0.014967 -0.1042963 0.1053088 0.0103826 0.0413734 0.0379801 -0.1574535 0.0568055 -0.0061323 0.0809846 0.0506937 -0.0112687 0.0143586 -0.0214478 0.1044625 0.0982015 -0.0022093 0.0762765 -0.0230599 0.0844055 -0.018902 0.0430481 -0.0248006 -0.1437387 0.1059813 0.0173816 -0.0179289 -0.0390023 -0.1023998 0.0544712 -0.0065809 0.1079988 0.0485408 -0.0613132 0.0053901 -0.0658051 0.028457 0.0960795 0.0477394 -0.1125986 0.024911 0.0502593 0.0958418 -0.0265723 0.0016282 0.0022083 0.0810244 -0.0821935 0.0237979 -0.0692227 -0.0516179 0.0839877 0.0611573 0.0130056 0.0120613 -0.1025446 0.0300703 -0.0179562 0.0082939 0.1264146 unknown
polarizability: 126.2679744|3.686065|85.686054|-1.6258639|-3.3505317|79.4228376 unknown
InChI: InChI=1S/C8H14O3/c1-6(2)11-8(10)5-4-7(3)9/h6H,4-5H2,1-3H3
charge 0 multiplicity 1
25 atoms
O  1.664735 0.488981 -0.032136
O  0.665449 -1.584421 -0.425844
O  -3.310722 1.000371 -1.186733
C  3.037849 -0.130781 -0.164835
C  -0.727828 0.436983 -0.135007
C  -1.931127 -0.455391 0.209456
C  0.568199 -0.35063 -0.21159
C  3.402307 -0.208211 -1.653968
C  3.96336 0.765953 0.659653
C  -3.260929 0.090557 -0.315995
C  -4.523469 -0.536824 0.26108
H  2.972279 -1.149088 0.261989
H  -0.910765 0.90633 -1.123231
H  -0.608591 1.272004 0.575622
H  -2.011351 -0.639123 1.298128
H  -1.776664 -1.457707 -0.245077
H  4.416485 -0.632296 -1.771221
H  2.694784 -0.856329 -2.197697
H  3.392027 0.798295 -2.108538
H  4.995141 0.371433 0.62814
H  3.637009 0.806903 1.712891
H  3.970515 1.793807 0.256387
H  -5.392976 -0.302654 -0.372494
H  -4.706049 -0.126357 1.273821
H  -4.415366 -1.631203 0.370098
