program: Gaussian 09
title: 000089071
version: EM64L-G09RevD.01
frameworkgroup: C1[X(C15H10BrNO3)]
method: RPBEPBE
basis: SDD
operation: Freq
keyword: #p
keyword: freq=noraman
keyword: PBEPBE/SDD
title: #p freq=noraman PBEPBE/SDD
converged: NO YES NO NO
title: Mulliken charges:
elementType: Br O O O N C C C C C C C C C C C C C C C H H H H H H H H H H
charge: 0.045261 -0.301264 -0.198821 -0.177553 -0.003581 0.320388 0.374814 -0.136512 0.528730 -0.457063 -0.489117 -0.304843 -0.835407 -0.186579 -0.374971 0.187265 0.219959 -0.317339 -0.259527 -0.148238 0.255173 0.255400 0.243564 0.234965 0.237819 0.231112 0.247841 0.281359 0.259888 0.267276
chargesum: 0.00000
title: Mulliken charges with hydrogens summed into heavy atoms:
elementType: Br O O O N C C C C C C C C C C C C C C C
charge: 0.045261 -0.301264 -0.198821 -0.177553 -0.003581 0.320388 0.374814 -0.136512 0.528730 -0.201890 -0.489117 -0.049443 -0.119059 0.044533 -0.127130 0.187265 0.219959 -0.035980 0.000361 0.119039
polarizability: 2.70765770e+02 6.19003494e+00 2.33151426e+02 -1.30724023e+01 -2.56696969e+00 1.11040296e+02
1716.lowfreq: -2.8957 -0.0001 0.0002 0.0005 3.3969 6.7087 22.6008 39.3260 42.7221
frequency: 22.5675 39.3220 42.7157 71.1010 84.0221 112.6024 141.7623 149.3358 165.0026 170.5101 198.9981 232.5634 243.1848 271.1300 288.2509 331.2946 360.7318 429.9291 463.8930 492.7991 504.9509 509.6386 546.2116 577.0204 589.8443 592.7714 610.1726 654.1118 691.1810 705.1400 749.1486 755.4967 763.5648 807.3772 832.8638 842.2299 848.2419 870.1795 879.3617 881.2931 903.1837 943.6039 961.5353 979.3002 987.8258 1024.7915 1028.6092 1044.9760 1046.3131 1054.0325 1075.1401 1144.3924 1152.9560 1204.7735 1212.5245 1233.3174 1252.5119 1256.5002 1325.0012 1363.2688 1368.6663 1386.0183 1399.9333 1407.8950 1437.3668 1455.8426 1472.0683 1478.7395 1493.3701 1544.6290 1559.9373 1589.1433 1598.4499 1693.5949 2976.7456 3051.9123 3092.3772 3128.1889 3147.3666 3159.3257 3171.4678 3228.4202 3249.9186 3268.8795
redmass: 7.0589 6.2458 5.0596 7.3173 7.3950 7.4484 3.7969 2.8318 1.8507 3.2016 4.6983 5.1898 7.0589 4.4095 7.5816 7.2594 5.6649 4.1265 7.2558 6.3143 5.1655 4.9255 4.6574 7.6078 2.9518 5.1733 5.1800 4.4888 6.9473 6.9447 5.8822 1.2482 7.2866 1.5997 4.7393 1.3367 6.5850 6.7443 1.3647 5.1519 1.3901 1.4158 3.8580 2.3707 1.3715 2.2358 1.7078 4.5575 1.5762 2.8427 2.4085 1.7829 1.4276 2.2469 1.6199 1.9981 3.6975 4.1869 6.8009 2.3913 2.6161 1.9686 1.4858 3.5603 3.3251 5.2013 1.0460 1.1205 4.0737 6.5948 8.7605 6.1055 7.0503 12.3784 1.0381 1.0975 1.0979 1.0894 1.0895 1.0919 1.0997 1.0917 1.0994 1.1090
irintensity: 2.9596 1.0674 2.1073 2.4698 0.7220 0.2616 0.0700 0.9270 0.1876 0.1714 0.1389 2.2057 2.1687 0.8637 1.4351 4.1088 0.3538 0.8402 0.3110 2.9355 2.5387 0.8646 2.3820 6.2033 9.5900 1.1767 5.1358 3.9610 12.2910 4.8099 27.7126 79.9750 49.4058 28.0155 10.7993 10.2285 34.3724 7.3958 19.4410 87.5250 0.7017 0.3226 271.3972 4.4844 0.3562 12.7198 69.2079 166.8859 10.3635 99.4098 82.8517 31.1090 16.0979 107.6539 56.6777 32.0326 15.7772 86.8462 9.0935 36.5114 3.3117 47.9922 11.8640 11.3244 91.3498 64.8381 15.4937 22.4294 22.9467 29.6515 3.7487 57.4534 22.2545 278.4663 31.6051 16.6501 15.9820 14.0406 7.9600 6.0884 27.9712 3.0128 0.6314 0.0733
temp: 298.150 k
press: 1.00000 atm
elementType: 35 8 8 8 7 6 6 6 6 6 6 6 6 6 6 6 6 6 6 6 1 1 1 1 1 1 1 1 1 1
symmnumber: 1
zpe: 556726.1 jmol-1
zpe.correction: 0.212046 hartree
zpe.thermalcorrener: 0.229227 hartree
zpe.thermalcorrenthalpy: 0.230171 hartree
zpe.thermalcorrgfe: 0.164595 hartree
zpe.sumelectzpe: -870.067773 hartree
zpe.sumelectthermal: -870.050592 hartree
zpe.sumelectthermalent: -870.049648 hartree
zpe.sumelectthermalfe: -870.115224 hartree
dipole: -2.0300 -1.6816 -2.6621
dipole: 3.7464
quadrupole: -82.7568 -114.3993 -130.1612
quadrupole: 4.5121 -7.5628 2.0352
quadrupole: 26.3490 -5.2935 -21.0554 4.5121 -7.5628 2.0352
hfenergy: -870.279819 hartree
pointgroup: C01 [X(C15H10Br1N1O3)]
dipole: 0.9038564 0.6178172 -0.9868611 debye
polarizability: 271.3676436|-1.0420397|231.2165432|15.4431211|10.6495309|112.3733056 unknown
InChI: InChI=1S/C15H10BrNO3/c1-9-8-11(16)14(13-10(9)4-2-6-17-13)20-15(18)12-5-3-7-19-12/h2-8H,1H3
charge 0 multiplicity 1
30 atoms
Br -0.029567 -3.718663 -0.293578
O  -0.939836 -0.728901 -0.34463
O  -3.978694 0.739415 1.063868
O  -1.279891 0.066608 1.859416
N  0.62456 1.55703 -0.126593
C  2.701141 0.192005 0.047578
C  3.304526 -1.118568 0.05463
C  1.265691 0.330817 -0.076882
C  0.448058 -0.852065 -0.164372
C  2.474462 -2.238844 -0.060219
C  1.057261 -2.106382 -0.163786
C  3.457918 1.404617 0.152943
C  4.806663 -1.290387 0.182305
C  2.804758 2.638733 0.120094
C  1.382649 2.664554 -0.03047
C  -1.703684 -0.100641 0.704526
C  -3.02276 0.216263 0.164201
C  -3.581826 0.119915 -1.107286
C  -4.937059 0.597001 -1.010019
C  -5.136843 0.960308 0.316709
H  2.908772 -3.243036 -0.061563
H  4.546352 1.358431 0.258291
H  5.083781 -2.356991 0.16278
H  5.347531 -0.788532 -0.642324
H  5.185483 -0.863623 1.130274
H  3.359131 3.578512 0.20184
H  0.847542 3.620497 -0.072217
H  -3.064537 -0.24796 -1.989868
H  -5.668275 0.664146 -1.812573
H  -5.980108 1.367041 0.868224
