program: Gaussian 09
title: 000089051
version: EM64L-G09RevD.01
frameworkgroup: C1[X(C9H7N3)]
method: RPBEPBE
basis: SDD
operation: Freq
keyword: #p
keyword: freq=noraman
keyword: PBEPBE/SDD
title: #p freq=noraman PBEPBE/SDD
converged: NO NO NO NO
title: Mulliken charges:
elementType: N N N C C C C C C C C C H H H H H H H
charge: -0.248205 -0.065439 -0.026717 0.043897 0.340870 0.396107 -0.204916 -0.339943 -0.207277 -0.770470 -0.416560 -0.251515 0.270134 0.248987 0.236737 0.249925 0.249925 0.215820 0.278640
chargesum: 0.00000
title: Mulliken charges with hydrogens summed into heavy atoms:
elementType: N N N C C C C C C C C C
charge: -0.248205 -0.065439 -0.026717 0.043897 0.340870 0.396107 0.065218 -0.090956 0.029460 -0.054799 -0.137921 -0.251515
polarizability: 1.77889449e+02 -2.36290441e+00 1.26703172e+02 -7.70706573e-03 -2.19928948e-03 4.91837914e+01
1716.lowfreq: -7.8474 -5.0052 -0.0009 -0.0008 -0.0008 5.3409 86.9256 96.3377 120.0240
frequency: 86.9137 96.3200 120.0215 188.3320 233.1578 256.6001 267.2593 404.2755 485.4827 489.6627 510.4352 519.8497 577.2382 581.4495 654.9570 663.3743 695.2579 755.0673 777.3737 853.5432 875.1071 887.0123 930.4648 956.3281 1004.6887 1049.6232 1080.2344 1122.8895 1148.2597 1178.9520 1257.9310 1273.3091 1289.8727 1310.7824 1352.2007 1404.6016 1432.9162 1453.8897 1464.9285 1478.0213 1496.7934 1559.1797 1624.5271 2166.0798 2991.6502 3072.4483 3102.6793 3150.8390 3174.8715 3196.4033 3233.1134
redmass: 3.2929 1.1947 8.3022 3.9388 4.6821 3.1454 4.4057 7.1349 7.3727 5.5171 3.5851 6.9791 5.4286 3.8741 4.1408 8.2325 6.1704 3.0705 1.6713 5.3179 1.3940 1.3303 3.1656 1.3164 2.1978 1.5283 1.7702 5.6778 1.5845 1.6105 2.1686 3.9963 2.5846 3.5480 2.8637 1.2498 2.3011 1.0435 1.6005 4.8169 2.6796 5.9890 6.4253 12.5881 1.0365 1.0967 1.1007 1.0904 1.0901 1.1007 1.0985
irintensity: 0.0302 1.4533 3.7762 2.1378 13.7211 2.9418 0.1041 1.6071 0.1270 0.9956 1.2292 0.5030 2.3404 0.4473 1.4322 0.6063 3.6941 29.9799 51.7478 0.7908 22.4380 1.8141 7.8669 0.4805 0.7184 8.9746 8.6402 9.1637 20.0236 32.8007 16.3817 22.8954 2.3320 85.8708 8.8625 27.8156 1.9127 14.7188 0.2562 25.3094 34.7034 12.0143 1.8407 122.2602 16.5212 10.2195 18.5946 8.0657 2.8665 3.2903 0.5446
temp: 298.150 k
press: 1.00000 atm
elementType: 7 7 7 6 6 6 6 6 6 6 6 6 1 1 1 1 1 1 1
symmnumber: 1
zpe: 370466.5 jmol-1
zpe.correction: 0.141103 hartree
zpe.thermalcorrener: 0.150786 hartree
zpe.thermalcorrenthalpy: 0.151730 hartree
zpe.thermalcorrgfe: 0.105834 hartree
zpe.sumelectzpe: -510.573852 hartree
zpe.sumelectthermal: -510.564170 hartree
zpe.sumelectthermalent: -510.563225 hartree
zpe.sumelectthermalfe: -510.609121 hartree
dipole: -4.3288 1.8603 0.0005
dipole: 4.7116
quadrupole: -79.1589 -65.0436 -71.7540
quadrupole: -6.8386 0.0024 0.0005
quadrupole: -7.1734 6.9419 0.2315 -6.8386 0.0024 0.0005
hfenergy: -510.7149555 hartree
pointgroup: C01 [X(C9H7N3)]
dipole: -1.717839 0.6965506 0.0002148 debye
dipolederiv: 0.3036183 -0.3605896 -0.0000217 -0.0602143 -0.4238648 0.0000147 -0.0000416 -0.0000067 0.0543488 -0.861881 -0.0207201 0.0000368 0.3516372 -0.5110654 -0.0000072 0.0000155 0.0000072 -0.2556369 -0.6818105 -0.0368626 -0.0001146 -0.1977381 -0.2374771 -0.0000426 0.0000874 0.0000008 -0.2483368 -0.062917 -0.1022482 0.0000041 -0.6070249 0.5112043 0.0000208 -0.0000011 0.0000003 0.0309093 0.27025 0.2361249 -0.000003 0.3387006 0.1503434 -0.0000085 -0.0000068 -0.0000034 -0.0011042 -0.5068466 -0.008177 0.0000353 -0.4224519 -0.0545632 0.00003 0.0000274 -0.0000025 0.0680562 -0.0188085 -0.0094986 0.0000082 -0.0002624 0.1005133 -0.0000064 0.0000012 -0.0000025 -0.1002322 -0.0570429 0.0245435 0.0000061 -0.2414115 -0.0967974 0.0000065 0.0000021 0.0000011 -0.1605486 0.0904058 -0.0433316 -0.0000078 0.0952039 0.0795133 -0.0000043 0.0000019 -0.0000015 -0.1506465 0.0091101 -0.0959132 0.0000015 -0.1908854 -0.1059637 0.000002 0.0000058 0.0000013 0.0378025 0.5482609 0.1314904 -0.0000262 0.3082788 0.3485137 -0.0000233 -0.0000527 -0.0000067 -0.0944062 0.8475179 0.1953027 0.0000762 0.4209207 -0.0082021 0.0000163 -0.0000455 0.0000048 0.0511099 0.0252319 -0.0513333 -0.0000004 -0.0074735 0.0641238 0.0000032 0.0000017 0.0000056 0.1923846 -0.0790958 0.0568064 0.0000015 0.0427755 0.0833139 0.0000002 -0.0000005 0.0000006 0.1604364 0.0942704 0.0148724 0.0000008 0.0137526 -0.0683805 0.0000006 0.0000012 0.0000007 0.167155 0.068687 -0.0083774 -0.0379273 -0.0299471 0.0422069 0.0914119 0.016164 0.1009285 -0.0168776 0.0686882 -0.0083767 0.0379263 -0.0299479 0.0422013 -0.0914125 -0.0161636 -0.1009303 -0.0168729 -0.1125402 0.0341814 0.0000013 0.1491499 0.0261833 0.0000003 -0.0000009 0.0000007 0.1119695 0.054902 0.0521064 0.000003 0.0669378 0.0581971 -0.0000017 0.0000047 0.0000021 0.1704898 unknown
polarizability: 177.9652178|-1.3035452|126.6274024|-0.00766|-0.0023581|49.1837914 unknown
InChI: InChI=1S/C9H7N3/c1-7-3-2-4-12-8(5-10)6-11-9(7)12/h2-4,6H,1H3
charge 0 multiplicity 1
19 atoms
N  0.321113 0.318934 0.000044
N  -0.29119 -1.901647 0.000062
N  3.900897 0.604935 -0.000435
C  -0.762135 -0.613501 0.000058
C  -2.106018 -0.130359 0.000063
C  1.508817 -0.445177 0.000033
C  0.123433 1.692115 0.000037
C  -2.292207 1.259035 0.000053
C  -1.18137 2.165073 0.000038
C  -3.235814 -1.131574 0.00008
C  1.082591 -1.797246 0.000047
C  2.800229 0.126348 0.000014
H  1.013472 2.324889 0.000027
H  -3.310163 1.661797 0.000055
H  -1.348952 3.244986 0.000031
H  -3.172872 -1.792178 0.88357
H  -3.172878 -1.7922 -0.883396
H  -4.216434 -0.627232 0.000075
H  1.725081 -2.675298 0.000043
