program: Gaussian 09
title: 000008048
version: EM64L-G09RevD.01
frameworkgroup: C1[X(C12H24O2)]
method: RPBEPBE
basis: SDD
operation: Freq
keyword: #pfreq=noraman
keyword: PBEPBE/SDD
title: #p freq=noraman PBEPBE/SDD
converged: YES YES NO NO
title: Mulliken charges:
elementType: O O C C C C C C C C C C C C H H H H H H H H H H H H H H H H H H H H H H H H
charge: -0.267281 -0.240536 -0.379563 -0.384108 -0.372744 -0.368067 -0.353022 -0.377695 -0.356671 -0.516485 -0.696522 0.236069 -0.225970 -0.673021 0.191204 0.191191 0.195701 0.195175 0.189994 0.190151 0.189662 0.190623 0.187445 0.187397 0.219406 0.212712 0.195009 0.195110 0.243283 0.245152 0.209487 0.215164 0.209555 0.226256 0.226826 0.229210 0.229295 0.210611
chargesum: 0.00000
title: Mulliken charges with hydrogens summed into heavy atoms:
elementType: O O C C C C C C C C C C C C
charge: -0.267281 -0.240536 0.002831 0.006768 0.007401 0.012218 0.021820 0.054423 0.033448 -0.028050 -0.062316 0.236069 0.227112 -0.003906
polarizability: 1.88015193e+02 2.37993991e+00 1.22689790e+02 -6.17310617e-01 1.92931515e-01 1.06967721e+02
1716.lowfreq: -25.1992 -18.2430 -7.7894 -0.0012 0.0007 0.0014 4.3032 18.5239 29.7651
frequency: -22.0020 18.0580 29.6701 39.8170 46.3696 55.4284 81.5628 92.1471 102.4972 136.3224 141.0553 146.4035 155.9509 168.7021 223.6311 230.7054 251.3227 305.6088 328.9938 363.7147 414.0799 472.1028 493.8634 549.5483 679.8239 719.8772 721.7813 732.6924 764.0594 797.3394 812.3933 816.1895 879.8921 886.7445 906.7592 949.5001 989.9519 1004.1935 1013.2241 1024.6925 1041.6544 1061.4276 1074.9470 1080.6739 1087.0190 1108.2528 1112.8846 1119.0128 1132.1476 1135.8615 1184.0595 1211.1094 1213.0567 1245.9681 1247.4514 1248.2685 1273.3308 1280.4040 1282.2694 1286.4198 1295.1949 1296.3381 1314.2081 1339.0261 1350.7698 1353.0850 1356.5754 1365.5472 1386.8343 1398.9809 1439.3181 1459.8919 1460.4602 1463.3312 1463.6044 1466.5857 1472.9178 1474.1818 1476.7658 1479.4750 1485.1659 1486.9876 1488.4872 1641.0030 2948.7501 2949.8091 2950.6840 2955.3441 2962.2929 2967.9165 2971.0158 2982.5752 2983.4354 2987.8285 2993.7475 2994.6995 2996.2053 3008.2435 3010.3190 3024.5972 3031.2421 3039.5546 3061.1525 3066.1239 3067.5829 3070.1414 3091.3317 3106.2143
redmass: 2.2150 3.6913 3.7846 2.0364 2.5561 2.4975 3.8140 2.1505 1.8788 2.2646 1.8624 3.6013 2.1407 4.5172 3.6456 1.1153 1.2636 3.8982 3.7627 3.6241 3.2251 3.2098 3.1353 2.6681 5.7984 1.0596 1.0827 1.1261 1.1981 1.0969 3.0744 1.3446 1.2789 1.9416 5.7422 1.2370 4.4308 3.7556 1.1305 2.5101 3.1260 3.2484 2.5782 2.0814 2.2975 1.8221 1.8412 2.4780 3.0818 1.4891 1.8055 1.3184 1.4793 1.2904 1.1553 1.3438 1.1685 1.0646 1.3335 1.0783 1.1210 1.0997 1.4046 1.4564 1.5525 1.5906 1.5685 1.6959 1.2166 1.2679 1.0859 1.0724 1.0725 1.0406 1.0643 1.0797 1.0802 1.0584 1.0441 1.0824 1.0888 1.0700 1.0930 9.7398 1.0586 1.0585 1.0589 1.0592 1.0589 1.0585 1.0365 1.0960 1.0623 1.0979 1.0610 1.0359 1.0994 1.0581 1.1031 1.1030 1.1002 1.1043 1.1030 1.1065 1.1007 1.0992 1.0985 1.1025
irintensity: 0.1809 0.0880 0.2139 0.2421 0.1373 0.1573 0.3827 0.0687 0.2943 1.3331 0.5952 1.8568 5.4270 0.3712 4.8259 0.0300 1.5039 5.6292 0.7940 8.3908 1.1400 1.0157 2.2728 1.6301 2.9172 18.5909 0.5248 5.2839 0.0908 4.5045 4.0177 3.1934 0.0379 2.8164 25.2994 1.5623 0.7351 1.0140 0.0233 53.0502 1.3581 78.7501 4.2989 3.8464 9.5401 50.6537 1.9692 28.0522 232.3502 13.5506 0.1654 47.3918 0.5340 0.1523 0.0186 23.6889 0.1054 0.8491 23.7878 1.1829 0.0133 0.1457 22.5605 9.9698 3.7570 0.3858 0.9066 14.9357 11.2098 18.0806 23.7828 0.1117 0.2432 11.7880 0.1014 0.2805 3.3553 4.7592 12.0717 1.8394 3.2163 12.1254 33.8584 167.5944 2.2043 0.0111 5.5091 0.4007 50.4510 159.1562 36.3892 0.5540 3.9480 1.1054 36.8903 26.6035 2.5969 21.6873 2.6431 0.6654 4.6641 135.2509 79.1499 12.0973 103.4610 55.1970 31.7611 47.1802
temp: 298.150 k
press: 1.00000 atm
elementType: 8 8 6 6 6 6 6 6 6 6 6 6 6 6 1 1 1 1 1 1 1 1 1 1 1 1 1 1 1 1 1 1 1 1 1 1 1 1
symmnumber: 1
zpe: 887679.5 jmol-1
zpe.correction: 0.338099 hartree
zpe.thermalcorrener: 0.356002 hartree
zpe.thermalcorrenthalpy: 0.356947 hartree
zpe.thermalcorrgfe: 0.288917 hartree
zpe.sumelectzpe: -620.967862 hartree
zpe.sumelectthermal: -620.949958 hartree
zpe.sumelectthermalent: -620.949014 hartree
zpe.sumelectthermalfe: -621.017044 hartree
dipole: -0.5562 -1.6604 0.0358
dipole: 1.7515
quadrupole: -76.8784 -95.4310 -86.5021
quadrupole: 5.5457 -0.2540 0.1088
quadrupole: 9.3921 -9.1605 -0.2316 5.5457 -0.2540 0.1088
hfenergy: -621.3059609 hartree
pointgroup: C01 [X(C12H24O2)]
dipole: -0.2186966 -0.6497457 0.0694654 debye
polarizability: 188.0170969|2.3565408|122.609225|-0.5615518|-1.1488166|107.0463816 unknown
InChI: InChI=1S/C12H24O2/c1-3-5-6-7-8-9-10-11-12(13)14-4-2/h3-11H2,1-2H3
charge 0 multiplicity 1
38 atoms
O  -4.753885 -0.49318 0.017858
O  -3.732241 1.585004 -0.242688
C  2.786741 -0.439197 -0.013295
C  1.491612 0.403678 -0.010108
C  4.073715 0.416099 0.012024
C  0.205606 -0.452598 -0.038265
C  5.369183 -0.426563 0.007916
C  -1.08378 0.397326 -0.036505
C  6.656726 0.428783 0.033818
C  -2.35523 -0.4725 -0.06382
C  7.945519 -0.421747 0.028451
C  -3.637695 0.343266 -0.107495
C  -6.088759 0.180418 -0.030003
C  -7.139403 -0.914531 0.124636
H  2.783091 -1.12066 0.863305
H  2.79807 -1.090634 -0.91239
H  1.495972 1.086129 -0.885484
H  1.479443 1.05383 0.889514
H  4.063294 1.067317 0.911212
H  4.077564 1.097885 -0.864235
H  0.220166 -1.102226 -0.938891
H  0.202927 -1.135362 0.837492
H  5.381374 -1.077479 -0.891568
H  5.366726 -1.10876 0.883988
H  -1.087726 1.078918 -0.908308
H  -1.102166 1.048479 0.858868
H  6.643815 1.07813 0.933105
H  6.657962 1.110739 -0.84105
H  -2.350339 -1.14119 -0.948217
H  -2.400867 -1.143989 0.815092
H  7.981143 -1.091557 0.908517
H  8.851221 0.212127 0.049166
H  7.997202 -1.056132 -0.876707
H  -6.173786 0.717515 -0.992219
H  -6.130551 0.927373 0.783418
H  -7.0621 -1.652905 -0.691764
H  -7.017584 -1.444451 1.084799
H  -8.151258 -0.470353 0.097731
