program: Gaussian 09
title: 000008042
version: EM64L-G09RevD.01
frameworkgroup: C1[X(C17H34O2)]
method: RPBEPBE
basis: SDD
operation: Freq
keyword: #pfreq=noraman
keyword: PBEPBE/SDD
title: #p freq=noraman PBEPBE/SDD
converged: YES YES NO NO
title: Mulliken charges:
elementType: O O C C C C C C C C C C C C C C C C C H H H H H H H H H H H H H H H H H H H H H H H H H H H H H H H H H H
charge: -0.278825 -0.255290 -0.385906 -0.385333 -0.384314 -0.386328 -0.382216 -0.374397 -0.372372 -0.384544 -0.353546 -0.375670 -0.356508 -0.534618 -0.696906 0.264663 0.034040 -0.684696 -0.681973 0.192150 0.194430 0.195196 0.191506 0.193627 0.191911 0.196240 0.190422 0.192248 0.191132 0.185486 0.198403 0.188710 0.189568 0.184345 0.222610 0.187212 0.187735 0.220965 0.200761 0.194429 0.194868 0.243242 0.238024 0.209685 0.209465 0.214660 0.231191 0.223165 0.207449 0.231103 0.218860 0.211151 0.252790
chargesum: 0.00000
title: Mulliken charges with hydrogens summed into heavy atoms:
elementType: O O C C C C C C C C C C C C C C C C C
charge: -0.278825 -0.255290 0.000675 0.001370 0.001224 0.000335 0.001163 0.009491 0.005905 0.022412 0.021402 0.046056 0.032789 -0.053352 -0.063095 0.264663 0.265231 -0.022979 0.000827
polarizability: 2.46851392e+02 4.24107640e+00 1.77160975e+02 -5.11427241e+00 -6.16387237e-01 1.58353043e+02
1716.lowfreq: -12.7049 -5.6525 -0.0017 -0.0016 0.0016 2.3566 9.1132 11.2556 22.8632
frequency: -3.8746 8.7753 21.9410 27.2726 33.6949 53.0052 56.0784 66.4936 76.2502 87.3920 91.8998 101.4680 123.2964 124.5318 143.9261 148.5937 148.7999 161.0641 170.1035 189.1936 220.1691 225.1592 238.0898 258.8068 271.4043 317.9718 330.7261 381.7084 395.7545 411.0672 443.9174 471.2774 484.2094 515.2931 558.4308 640.0221 718.6443 720.2901 724.5067 733.8996 751.8011 773.2689 786.5301 822.1277 850.7278 859.6503 887.3297 889.3098 910.0107 924.8149 939.3195 943.2865 977.5436 984.9373 990.4421 1007.7605 1026.5838 1032.4983 1041.3136 1062.8839 1076.1685 1078.3521 1080.7417 1082.9861 1086.2699 1094.0844 1107.3776 1122.8381 1151.8835 1156.2751 1180.5873 1184.2387 1187.4632 1203.0832 1212.3081 1229.1651 1237.8928 1253.1984 1262.0613 1272.7897 1278.3042 1283.7596 1285.7143 1287.3775 1291.0458 1293.6702 1295.9696 1310.4279 1318.4703 1331.2102 1335.2023 1346.9364 1349.9474 1353.8672 1355.8490 1357.0419 1362.2896 1379.7574 1387.9592 1397.3699 1439.1870 1455.5930 1456.9095 1459.2063 1459.6231 1462.2581 1463.3029 1464.6657 1465.2411 1468.5772 1472.5490 1473.2598 1475.6284 1478.1250 1482.7714 1486.5080 1487.4220 1488.6714 1634.1643 2947.1324 2947.2186 2948.9489 2949.4781 2950.8117 2952.9639 2956.6649 2960.3382 2963.9024 2967.6947 2970.9798 2978.9075 2980.7558 2983.1487 2986.9865 2988.4550 2991.1154 2992.4805 2992.8582 3000.0211 3008.9359 3017.7303 3024.6050 3026.0385 3034.1166 3041.0216 3046.8431 3059.2790 3067.3537 3069.5391 3083.2475 3092.5094 3098.1522 3104.0536
redmass: 3.6293 3.0265 2.1301 3.3852 3.1901 3.1986 1.6168 4.6772 3.7380 3.1588 1.6389 3.6550 1.9039 2.2369 2.7339 2.2335 2.1487 2.7483 3.0944 1.0346 1.1406 2.2417 1.2917 2.6060 3.8893 2.9842 3.0963 3.8006 2.8176 2.8857 2.5357 3.1383 2.8711 3.1208 3.3127 2.8305 1.0584 1.0671 1.0870 1.1363 1.2304 2.3540 1.5028 1.4644 2.5920 1.7154 1.8921 1.4906 2.3596 1.2126 1.3214 1.3973 4.0103 1.9189 2.0429 3.4766 1.4784 1.7978 3.2184 2.6365 2.5631 2.1878 2.0775 1.9922 2.2196 2.5346 1.7453 2.8033 2.4319 2.0550 1.8341 1.9022 1.3036 1.5568 1.3371 1.4188 1.3116 1.3329 1.2889 1.2609 1.0161 1.0706 1.1988 1.2165 1.0714 1.1327 1.1109 1.3330 1.3246 1.4007 1.3932 1.4864 1.6367 1.7017 1.6217 1.6566 1.5935 1.2562 1.2177 1.2348 1.0907 1.0797 1.0526 1.0750 1.0748 1.0695 1.0680 1.0523 1.0691 1.0828 1.0507 1.0834 1.0430 1.0872 1.0920 1.0925 1.0501 1.0944 9.4083 1.0588 1.0588 1.0591 1.0593 1.0596 1.0598 1.0602 1.0604 1.0595 1.0586 1.0366 1.0631 1.0958 1.0965 1.0975 1.0357 1.0674 1.0378 1.0934 1.1008 1.1020 1.1028 1.0864 1.1039 1.1045 1.1042 1.1008 1.0993 1.1007 1.0993 1.0994 1.0987 1.1005 1.1005
irintensity: 0.5802 0.0163 0.0038 0.1801 0.0053 0.3313 0.0808 1.7419 0.0118 0.2449 0.0297 1.3891 0.0873 0.0497 0.6544 0.0924 0.0148 3.6906 0.9938 0.0339 0.0104 0.8623 0.2062 2.3149 7.7062 0.1965 0.0916 6.1668 4.0603 0.1527 1.2977 0.6378 0.0749 0.7014 4.4200 0.3650 19.0226 0.1327 8.8442 0.3736 5.6525 3.8709 1.6102 3.1435 9.1269 5.0510 4.6089 1.1787 18.9562 2.4364 6.2082 1.2689 4.4281 4.2835 1.7180 4.0656 1.4782 2.3997 2.6978 2.8756 7.3143 0.9718 0.3321 0.4531 31.9577 304.7605 11.2769 14.9647 161.5511 13.3637 9.6916 1.8942 26.7983 2.5644 2.5435 2.8524 0.0458 2.9953 0.1772 2.8133 0.1483 0.8463 0.3186 1.6865 0.4915 0.7947 2.6200 0.8897 15.8024 0.3487 6.3929 1.1775 30.5875 0.6606 0.2835 0.1115 0.0991 32.2075 11.1947 16.1461 30.3329 7.4255 5.8196 0.0504 0.5578 0.0179 0.4556 4.6870 0.8968 0.8680 4.9000 1.6653 12.2978 1.6941 2.7281 6.0510 20.1741 38.6950 145.1620 0.0054 0.1938 0.3681 0.1407 0.5197 2.6430 2.0646 1.3501 138.4763 202.5484 38.2667 44.2523 1.6899 1.7954 1.7913 14.9568 28.5661 25.2009 6.3502 2.1678 1.3717 0.9376 7.5217 5.4091 0.4414 205.4607 99.4173 69.4203 100.0074 56.6884 6.8365 53.9276 23.2471 31.0376
temp: 298.150 k
press: 1.00000 atm
elementType: 8 8 6 6 6 6 6 6 6 6 6 6 6 6 6 6 6 6 6 1 1 1 1 1 1 1 1 1 1 1 1 1 1 1 1 1 1 1 1 1 1 1 1 1 1 1 1 1 1 1 1 1 1
symmnumber: 1
zpe: 1252951.6 jmol-1
zpe.correction: 0.477224 hartree
zpe.thermalcorrener: 0.501901 hartree
zpe.thermalcorrenthalpy: 0.502846 hartree
zpe.thermalcorrgfe: 0.418026 hartree
zpe.sumelectzpe: -817.089086 hartree
zpe.sumelectthermal: -817.064408 hartree
zpe.sumelectthermalent: -817.063464 hartree
zpe.sumelectthermalfe: -817.148284 hartree
dipole: 1.0464 0.2256 -1.3248
dipole: 1.7033
quadrupole: -109.8563 -116.5151 -124.9308
quadrupole: 5.4428 -4.5818 1.7334
quadrupole: 7.2445 0.5856 -7.8301 5.4428 -4.5818 1.7334
hfenergy: -817.5663096 hartree
pointgroup: C01 [X(C17H34O2)]
dipole: 0.4099156 0.1048071 -0.5196522 debye
polarizability: 246.7436601|5.0424336|177.2719337|-5.1453071|-0.2393999|158.3498152 unknown
InChI: InChI=1S/C17H34O2/c1-4-5-6-7-8-9-10-11-12-13-14-15-17(18)19-16(2)3/h16H,4-15H2,1-3H3
charge 0 multiplicity 1
53 atoms
O  6.299819 0.332846 -0.437457
O  4.919932 0.001802 1.41657
C  -2.841704 -0.069578 -0.255061
C  -1.691586 -1.035575 0.108417
C  -4.233195 -0.583452 0.178339
C  -0.299649 -0.52405 -0.326207
C  -5.386645 0.372716 -0.200406
C  0.846382 -1.501194 0.019685
C  -6.777237 -0.142401 0.234926
C  2.237574 -0.990998 -0.417323
C  -7.933564 0.806396 -0.153514
C  3.371299 -1.986704 -0.083951
C  -9.323219 0.289586 0.284397
C  4.764864 -1.509595 -0.543481
C  -10.473851 1.240337 -0.111035
C  5.291718 -0.332132 0.266331
C  6.966612 1.49923 0.253041
C  8.359165 1.596487 -0.373564
C  6.101627 2.752217 0.054297
H  -2.841048 0.10369 -1.351846
H  -2.653087 0.918452 0.214922
H  -1.69154 -1.209817 1.204861
H  -1.881743 -2.023133 -0.362351
H  -4.237599 -0.746184 1.276631
H  -4.415963 -1.576936 -0.282688
H  -0.102286 0.456516 0.155214
H  -0.304123 -0.337331 -1.420821
H  -5.204209 1.367203 0.25835
H  -5.383267 0.533057 -1.299123
H  0.646893 -2.482553 -0.460647
H  0.85352 -1.685726 1.114087
H  -6.955679 -1.140524 -0.217746
H  -6.782883 -0.295647 1.334648
H  2.228421 -0.793969 -1.510289
H  2.444157 -0.023101 0.081161
H  -7.930676 0.958132 -1.253484
H  -7.75683 1.805539 0.297404
H  3.393954 -2.160392 1.008965
H  3.15573 -2.961666 -0.56481
H  -9.497152 -0.709963 -0.164376
H  -9.325808 0.140454 1.38366
H  5.505348 -2.32857 -0.437501
H  4.768553 -1.230438 -1.613104
H  -10.340533 2.237171 0.350428
H  -10.510864 1.382203 -1.20783
H  -11.455454 0.847036 0.212079
H  7.022972 1.247585 1.328834
H  8.285939 1.797406 -1.456872
H  8.927027 2.419756 0.096723
H  8.921227 0.657815 -0.230469
H  5.976437 2.96997 -1.021326
H  6.585846 3.624043 0.531671
H  5.10778 2.617087 0.512641
