program: Gaussian 09
title: 000089023
version: EM64L-G09RevD.01
frameworkgroup: C1[X(C3H4N2O2)]
method: RPBEPBE
basis: SDD
operation: Freq
keyword: #pfreq=noraman
keyword: PBEPBE/SDD
title: #p freq=noraman PBEPBE/SDD
converged: NO YES NO NO
title: Mulliken charges:
elementType: O O N N C C C H H H H
charge: -0.295462 -0.211246 -0.380465 -0.013578 0.328897 -0.489083 -0.052308 0.250476 0.250500 0.241156 0.371113
chargesum: 0.00000
title: Mulliken charges with hydrogens summed into heavy atoms:
elementType: O O N N C C C
charge: -0.295462 -0.211246 -0.009352 -0.013578 0.328897 0.253049 -0.052308
polarizability: 8.04284664e+01 4.08971979e+00 4.36145684e+01 1.11390194e-02 5.44241878e-03 2.77356584e+01
1716.lowfreq: -12.9077 -5.9953 0.0004 0.0011 0.0013 3.5186 68.3860 92.3539 131.9444
frequency: 68.3809 92.3448 131.9436 175.9658 262.2570 389.3112 466.9875 482.4301 569.1901 676.8728 702.5820 897.0485 957.2860 1120.2816 1121.4054 1153.0305 1180.4940 1421.7122 1444.5822 1454.0527 1467.6739 1696.1421 2227.2374 3012.0804 3117.2313 3159.4971 3535.3334
redmass: 1.1073 4.6363 7.2021 4.3442 4.5944 7.1905 8.2415 5.6285 1.3420 6.3535 8.8464 8.5186 8.0175 1.2546 8.7470 1.4839 2.2245 1.2310 1.6211 1.0485 1.0767 8.9213 12.3939 1.0296 1.1055 1.1050 1.0766
irintensity: 1.5267 0.0348 1.4236 18.0616 17.7726 2.6698 1.1095 4.0986 101.7742 17.2393 56.5955 4.1723 9.9427 0.2455 194.6807 76.3340 210.6163 49.7064 317.1033 16.0247 15.6589 241.2184 109.3470 28.8680 22.2890 12.1453 72.6448
temp: 298.150 k
press: 1.00000 atm
elementType: 8 8 7 7 6 6 6 1 1 1 1
symmnumber: 1
zpe: 197284.3 jmol-1
zpe.correction: 0.075142 hartree
zpe.thermalcorrener: 0.082693 hartree
zpe.thermalcorrenthalpy: 0.083637 hartree
zpe.thermalcorrgfe: 0.042799 hartree
zpe.sumelectzpe: -376.114355 hartree
zpe.sumelectthermal: -376.106804 hartree
zpe.sumelectthermalent: -376.105860 hartree
zpe.sumelectthermalfe: -376.146698 hartree
dipole: -4.7360 -3.2648 -0.0012
dipole: 5.7522
quadrupole: -44.6053 -41.1633 -39.6157
quadrupole: -4.2405 -0.0172 0.0005
quadrupole: -2.8105 0.6315 2.1790 -4.2405 -0.0172 0.0005
hfenergy: -376.1894964 hartree
pointgroup: C01 [X(C3H4N2O2)]
dipole: -1.8522915 -1.3002585 -0.0012076 debye
dipolederiv: -1.6100817 -0.1703228 0.0000823 -0.4116206 -0.5990021 -0.0001957 0.0016984 0.0004147 -0.3254465 -0.6100555 0.0274981 -0.0000804 0.1204321 -0.9592738 0.0016474 0.000182 -0.0010266 -0.3223859 -1.5341422 0.1158329 -0.0007607 0.2627699 -0.3316112 -0.0001932 -0.0017199 -0.0000065 -0.3189948 -0.4157868 0.0630388 -0.0002171 -0.0619011 -0.1848347 -0.0000674 -0.0002692 0.0000766 -0.240433 2.3349527 -0.091173 0.0006866 -0.2105683 1.5217375 -0.0022012 0.0000877 -0.0002522 0.3814505 0.7740116 -0.0272882 -0.0003511 -0.1835814 0.2220575 0.0002206 -0.0003309 0.0000696 0.2775839 0.9145179 0.1456604 0.0011899 0.4007891 -0.018543 0.0006627 0.0009883 0.000459 0.1191635 0.0072663 -0.0016525 0.0206538 0.0953986 0.0479521 0.094651 -0.030095 0.0868197 -0.0472715 0.007127 -0.0019515 -0.0209029 0.0950636 0.047856 -0.0948282 0.0297785 -0.0868465 -0.0471618 -0.0278976 -0.0704685 0.0001605 -0.1146707 -0.009495 0.0001602 0.0002731 0.0001394 0.1302402 0.1600884 0.0108262 -0.0004609 0.0078888 0.2631569 0.0001438 -0.000593 0.0001528 0.3932553 unknown
polarizability: 80.3563012|4.4018695|43.6867123|0.0358002|0.0059589|27.7356796 unknown
InChI: InChI=1S/C3H4N2O2/c1-7-3(6)5-2-4/h5H,1H3
charge 0 multiplicity 1
11 atoms
O  -1.605622 -0.723561 -0.001414
O  -0.511721 1.36706 -0.001467
N  0.64945 -0.701564 -0.000978
N  3.030939 0.212786 0.002828
C  -0.498642 0.123685 -0.003077
C  -2.918456 -0.032482 0.000127
C  1.911085 -0.207999 0.001103
H  -3.016633 0.595416 -0.900499
H  -3.014359 0.59591 0.900653
H  -3.659083 -0.843163 0.001296
H  0.495641 -1.713188 -0.000673
