program: Gaussian 09
title: 000089022
version: EM64L-G09RevD.01
frameworkgroup: C1[X(C10H16N6O)]
method: RPBEPBE
basis: SDD
operation: Freq
keyword: #p
keyword: freq=noraman
keyword: PBEPBE/SDD
title: #p freq=noraman PBEPBE/SDD
converged: YES YES NO NO
title: Mulliken charges:
elementType: O N N N N N N C C C C C C C C C C H H H H H H H H H H H H H H H H
charge: -0.216008 -0.395177 -0.144593 -0.332532 -0.160208 -0.074158 -0.020071 0.278023 -0.738535 -0.683145 0.102609 -0.155893 0.080676 -0.328796 0.041354 -0.687841 -0.505742 0.332862 0.238895 0.244638 0.227664 0.279517 0.220370 0.217556 0.214659 0.265966 0.327694 0.234658 0.208014 0.227089 0.235079 0.231861 0.233517
chargesum: 0.00000
title: Mulliken charges with hydrogens summed into heavy atoms:
elementType: O N N N N N N C C C C C C C C C C
charge: -0.216008 -0.062315 -0.144593 -0.004838 -0.160208 -0.074158 -0.020071 0.278023 -0.027338 0.034298 0.102609 -0.155893 0.080676 0.151828 0.041354 -0.018080 0.194716
polarizability: 1.83035995e+02 -1.01150392e+01 1.88568661e+02 1.39874040e+00 1.29542690e+00 1.04171741e+02
1716.lowfreq: -6.9639 -0.0005 -0.0004 0.0005 2.4537 7.2983 22.4526 35.3152 53.4947
frequency: 21.8148 35.2485 53.4835 70.1545 85.6188 121.6084 133.9245 144.3272 154.9627 176.3395 191.0294 201.4836 220.2166 225.9943 233.9868 258.2144 268.4409 300.0780 319.8480 343.0477 386.3366 391.3817 421.6385 496.5127 521.7980 546.8106 582.9233 586.9075 592.9757 660.0314 701.2793 704.6390 713.6357 724.0594 790.2970 800.0206 867.1717 891.9809 910.7974 930.5247 937.2267 967.7842 1018.6546 1043.9615 1052.1218 1100.2356 1112.4103 1137.0710 1155.7455 1163.8120 1171.3288 1196.4756 1223.1038 1240.7949 1262.5721 1309.2325 1331.4492 1363.1922 1370.5006 1385.3478 1395.2753 1398.2934 1443.5062 1451.0565 1451.3804 1462.5178 1468.7788 1474.1543 1475.8957 1479.6546 1489.4137 1493.4070 1500.8626 1507.1215 1528.8955 1590.6623 2184.8965 2965.0178 2983.3487 2992.9123 2997.0188 3000.0125 3059.3865 3083.9884 3091.4691 3096.8384 3097.5489 3101.4531 3115.1250 3125.6341 3140.3236 3553.8571 3559.6521
redmass: 2.5224 4.4329 6.3839 3.0131 3.3185 3.1138 2.0803 2.9339 1.9668 3.6644 4.2904 4.1780 2.8789 1.0651 4.0001 1.3975 1.2729 2.7960 3.2343 3.4722 3.7051 3.4711 4.9223 1.1687 7.0384 5.5428 4.1897 1.3907 3.5819 5.8169 10.4080 10.8088 3.9508 5.3359 10.2294 1.1707 3.5235 11.6670 2.1366 2.0382 1.7997 3.0200 1.3590 3.8104 2.9086 2.9513 1.2529 1.6366 1.6685 2.6554 3.4436 2.4993 3.3419 4.4107 1.2284 3.0549 1.7358 1.9671 1.1885 1.6552 1.4397 1.2291 1.4084 1.0688 1.0527 1.0606 1.0641 1.0595 1.1034 1.0614 2.1209 1.0772 1.1797 2.3068 6.9615 6.2846 12.6519 1.0695 1.0374 1.0356 1.0351 1.0294 1.0937 1.0975 1.1013 1.1004 1.1008 1.1044 1.0996 1.1005 1.1045 1.0768 1.0772
irintensity: 0.9591 1.8209 2.3491 6.6137 0.5068 1.5639 0.2857 2.5201 1.6116 1.1302 2.4837 3.3802 0.8521 0.2420 3.3248 0.3556 1.1022 5.1508 2.6688 6.4166 8.1327 0.7194 6.1939 93.5219 7.4572 2.8273 16.6537 76.1405 18.8324 6.7108 2.0328 0.7657 3.8838 1.6207 37.8694 3.9522 3.5777 4.1075 1.2615 6.5381 9.9715 10.6423 3.0306 31.7963 4.0560 3.4616 0.1633 5.6057 10.1487 49.3755 31.0559 48.8370 146.7825 79.9852 42.9668 174.7711 126.4957 54.4226 34.2796 108.2249 167.9905 25.6906 96.3815 29.4425 12.5514 50.5746 15.2061 6.0598 45.8105 38.9623 338.7470 33.6970 98.8649 270.1955 894.2449 378.1780 1.8477 51.3727 35.8313 13.1181 27.1433 49.1711 1.9887 34.4767 14.1837 33.6708 24.6733 31.5015 18.7150 5.1040 27.0183 70.5944 41.6501
temp: 298.150 k
press: 1.00000 atm
elementType: 8 7 7 7 7 7 7 6 6 6 6 6 6 6 6 6 6 1 1 1 1 1 1 1 1 1 1 1 1 1 1 1 1
symmnumber: 1
zpe: 694336.0 jmol-1
zpe.correction: 0.264459 hartree
zpe.thermalcorrener: 0.283007 hartree
zpe.thermalcorrenthalpy: 0.283951 hartree
zpe.thermalcorrgfe: 0.216940 hartree
zpe.sumelectzpe: -793.103709 hartree
zpe.sumelectthermal: -793.085160 hartree
zpe.sumelectthermalent: -793.084216 hartree
zpe.sumelectthermalfe: -793.151228 hartree
dipole: -1.5588 -2.4597 -2.5735
dipole: 3.8863
quadrupole: -106.9886 -76.2415 -106.1440
quadrupole: 1.6799 9.5662 -2.8880
quadrupole: -10.5306 20.2165 -9.6860 1.6799 9.5662 -2.8880
hfenergy: -793.3681672 hartree
pointgroup: C01 [X(C10H16N6O1)]
dipole: 0.5917277 -0.9496379 1.0420172 debye
polarizability: 182.679127|10.1361778|188.7333486|3.6804485|-1.9519499|104.3639216 unknown
InChI: InChI=1S/C10H16N6O/c1-5-12-7-13-8(15-9(14-7)17-4)16-10(2,3)6-11/h12,16H,5H2,1-4H3
charge 0 multiplicity 1
33 atoms
O  -3.707857 -0.946849 -0.150162
N  0.897597 -1.729125 0.219914
N  0.10669 0.491472 0.332975
N  -0.830867 2.653403 0.313554
N  -1.401077 -1.402994 0.025175
N  -2.302491 0.857293 0.090165
N  3.12877 0.303955 -1.584747
C  2.328931 -1.380959 0.353164
C  3.139706 -2.695518 0.175559
C  2.637323 -0.736931 1.73496
C  -0.15387 -0.837988 0.196636
C  2.742212 -0.43073 -0.728087
C  -1.005628 1.300608 0.247325
C  0.471829 3.328359 0.437909
C  -2.415922 -0.490992 -0.00466
C  0.437806 4.710907 -0.237489
C  -3.892305 -2.408564 -0.269142
H  0.644705 -2.7035 0.046883
H  2.949303 -3.153473 -0.81101
H  4.218725 -2.490074 0.258676
H  2.859207 -3.410291 0.970219
H  2.038686 0.177419 1.861882
H  3.709725 -0.484972 1.808116
H  2.381097 -1.456442 2.532204
H  0.745613 3.433779 1.508256
H  1.232363 2.679268 -0.02801
H  -1.688473 3.20739 0.265962
H  0.213511 4.617354 -1.314552
H  -0.322642 5.370748 0.22226
H  1.418534 5.206755 -0.131627
H  -3.360058 -2.797724 -1.153439
H  -4.979702 -2.533261 -0.374634
H  -3.51864 -2.923723 0.631865
