program: Gaussian 09
title: 000089130
version: EM64L-G09RevD.01
frameworkgroup: C1[X(C13H23NO5P2S)]
method: RPBEPBE
basis: SDD
operation: Freq
keyword: #p
keyword: freq=noraman
keyword: PBEPBE/SDD
title: #p freq=noraman PBEPBE/SDD
converged: NO YES NO NO
title: Mulliken charges:
elementType: S P P O O O O O N C C C C C C C C C C C C C H H H H H H H H H H H H H H H H H H H H H H H
charge: -0.022610 1.416080 0.942908 -0.493155 -0.547176 -0.517160 -0.635611 -0.617301 -0.761603 -0.309229 -0.676798 -0.132922 -0.273208 -0.245234 -0.232851 -0.210613 -0.228320 -0.215851 -0.224987 -0.671561 -0.659896 -0.473723 0.302142 0.238602 0.312221 0.269476 0.359264 0.320252 0.278078 0.224098 0.216971 0.235866 0.219422 0.248961 0.233556 0.232267 0.289186 0.227820 0.194183 0.228769 0.229576 0.210851 0.245282 0.233679 0.240302
chargesum: 0.00000
title: Mulliken charges with hydrogens summed into heavy atoms:
elementType: S P P O O O O O N C C C C C C C C C C C C C
charge: -0.022610 1.416080 0.942908 -0.493155 -0.547176 -0.517160 -0.635611 -0.617301 -0.402339 0.231515 -0.095101 -0.132922 0.047044 0.032844 0.208217 0.244675 0.020641 0.017706 0.007281 0.039627 0.009300 0.245540
polarizability: 2.75153262e+02 1.36357766e+00 2.44883840e+02 2.41171257e+00 -7.01820277e+00 1.84226052e+02
1716.lowfreq: -9.3378 -0.0015 0.0015 0.0016 3.7417 6.4096 7.1254 22.0820 26.7590
frequency: -3.0015 21.7757 26.7353 36.6079 40.9786 45.1001 53.8407 57.4836 61.3941 73.0005 76.3452 83.3976 90.6068 109.2522 129.2710 139.8083 163.6767 176.9365 190.6318 198.5106 202.7782 220.6723 235.9098 245.1004 253.1798 273.6447 277.3071 286.3866 293.0638 331.6148 336.6376 370.1449 394.0349 399.2095 405.2906 416.2172 458.0330 469.9371 492.6620 514.3448 606.4719 608.9741 638.0118 679.1328 693.9751 700.4201 703.0183 743.7195 765.8608 796.0746 808.4559 816.7013 866.9039 888.0925 892.3163 945.2200 972.5052 985.1124 991.6598 995.1975 1005.0050 1007.9459 1009.7063 1019.6453 1022.4258 1030.6598 1035.0466 1083.6240 1094.1365 1095.7788 1101.0695 1107.3110 1116.3386 1131.9879 1137.1407 1142.3250 1175.1068 1176.4032 1200.1352 1249.6212 1256.3623 1257.4354 1296.3504 1322.5245 1347.1406 1352.4769 1362.1449 1380.8197 1395.0270 1400.6778 1404.9045 1425.7139 1427.6471 1452.7308 1457.5327 1458.6951 1460.9584 1468.8001 1473.2588 1476.3578 1478.2387 1484.1929 1491.5125 1496.4172 1586.0210 1592.9216 2983.0655 2983.5577 2989.8810 2991.9507 2994.9849 3004.3573 3023.2488 3052.9579 3053.7069 3067.0161 3082.0521 3084.4360 3091.2023 3101.1221 3104.3150 3107.2533 3125.6476 3128.9499 3132.7213 3150.0372 3166.2277 3175.3684 3564.7562
redmass: 2.9470 4.4034 4.8144 4.4954 4.2337 3.0452 3.9616 3.2579 1.7951 5.6000 1.7024 3.7862 3.0408 4.2042 4.9006 2.7624 4.0492 3.7363 4.3174 3.2638 3.1550 4.6360 1.8324 3.3774 1.6674 3.4422 3.0925 5.3735 4.4647 5.8383 6.0005 3.4969 3.6549 2.8881 5.0984 1.7256 8.2799 6.6865 4.3530 5.2567 6.4008 5.4798 9.2936 5.3780 5.4330 2.2767 6.3906 1.7096 1.5275 2.1547 1.0876 1.1226 1.2439 3.4427 3.8012 1.3520 9.1081 4.1457 1.6594 7.4260 2.7158 1.3910 2.3888 2.8581 2.8834 3.3226 4.3084 1.9752 2.4989 3.0707 2.2173 2.1807 1.2470 1.3160 1.4368 1.4639 1.0578 1.2674 1.1344 1.1793 1.1374 1.1458 1.1721 1.3096 1.2514 1.2584 1.2536 7.9360 1.2508 1.2092 1.1600 1.2293 1.8373 1.0756 1.0493 1.0404 1.0407 1.9336 1.0609 1.0747 1.0487 1.0702 1.0824 1.0608 5.8259 5.7713 1.0304 1.0371 1.0523 1.0561 1.0405 1.0621 1.0578 1.1077 1.1075 1.1056 1.0975 1.1048 1.0983 1.1082 1.1028 1.1022 1.0918 1.1032 1.0877 1.0919 1.0967 1.0990 1.0765
irintensity: 0.0334 0.1814 1.0623 0.7946 0.6492 3.3612 0.4786 1.6690 4.5052 0.6094 1.3029 1.6918 3.3907 0.1350 17.9257 1.6043 3.3936 0.7832 4.0999 5.8338 18.9037 5.4000 0.5263 3.9423 4.8102 4.3542 5.6992 0.5558 11.9282 8.6376 3.8468 14.9602 15.8275 3.7089 52.7342 101.0521 9.6566 50.3049 15.0302 122.1519 4.1378 23.7558 106.6648 13.9584 138.6076 46.7562 19.9755 74.7413 36.7005 60.0219 4.8090 6.0537 4.3799 120.6285 254.5101 3.3422 162.2523 29.0008 17.3549 102.3551 89.9237 2.4381 73.9928 67.9181 10.2903 138.8180 102.8913 18.5093 25.9331 50.2313 11.6518 12.1699 0.0260 0.3729 4.4069 4.3945 0.3777 25.0855 2.6853 7.2094 0.2472 0.5850 21.6607 7.9178 12.4747 22.1539 0.8152 2.0400 29.9223 22.1048 14.3171 7.8954 22.2937 3.8634 12.9099 12.1002 6.9443 9.9866 19.3014 7.0209 6.9932 3.4055 10.9116 11.2239 0.0982 1.2365 43.3320 30.2252 26.0336 54.0524 31.6255 23.0604 9.0883 6.4518 32.6233 4.5226 24.5560 24.6159 30.0238 5.4307 15.0603 38.9262 34.5639 14.9208 9.7970 10.9274 13.2440 20.8423 43.1495
temp: 298.150 k
press: 1.00000 atm
elementType: 16 15 15 8 8 8 8 8 7 6 6 6 6 6 6 6 6 6 6 6 6 6 1 1 1 1 1 1 1 1 1 1 1 1 1 1 1 1 1 1 1 1 1 1 1
symmnumber: 1
zpe: 926247.2 jmol-1
zpe.correction: 0.352789 hartree
zpe.thermalcorrener: 0.379940 hartree
zpe.thermalcorrenthalpy: 0.380884 hartree
zpe.thermalcorrgfe: 0.292190 hartree
zpe.sumelectzpe: -2018.814749 hartree
zpe.sumelectthermal: -2018.787598 hartree
zpe.sumelectthermalent: -2018.786654 hartree
zpe.sumelectthermalfe: -2018.875348 hartree
dipole: 1.5389 -1.1288 1.3765
dipole: 2.3531
quadrupole: -128.4782 -137.2214 -157.3118
quadrupole: -0.3323 3.4950 -1.1879
quadrupole: 12.5256 3.7824 -16.3080 -0.3323 3.4950 -1.1879
hfenergy: -2019.1675374 hartree
pointgroup: C01 [X(C13H23N1O5P2S1)]
dipole: -0.5513421 0.3038336 0.6788125 debye
polarizability: 264.1676051|8.7121501|248.4460201|-25.8418368|-1.3450108|191.6495293 unknown
InChI: InChI=1S/C7H8O2P.C6H15NO3PS/c1-9-10(8)7-5-3-2-4-6-7;1-3-9-11(8,10-4-2)7-5-6-12/h2-6H,1H3;7H,3-6H2,1-2H3
charge 0 multiplicity 1
45 atoms
S  1.954062 1.733889 1.676386
P  -2.334031 -0.952863 0.888614
P  1.909956 1.210179 -0.593744
O  -2.884657 -0.39806 -0.648177
O  -3.703869 -1.53658 1.77968
O  3.216822 2.200377 -1.16244
O  -1.163786 -2.007853 0.641272
O  0.467401 1.489031 -1.236099
N  -2.047448 0.42182 1.889688
C  -0.890647 1.317101 1.67582
C  0.435048 0.693236 2.173308
C  2.612675 -0.478139 -0.831059
C  1.717028 -1.574965 -0.823421
C  4.005587 -0.659968 -1.004553
C  -3.569494 0.91547 -0.837795
C  -4.17346 -2.926215 1.509146
C  2.237545 -2.877499 -0.99755
C  4.506484 -1.966744 -1.187269
C  3.625089 -3.074532 -1.181322
C  -2.932161 1.580148 -2.0584
C  -5.300128 -3.19537 2.502126
C  2.969442 3.650358 -1.315272
H  -0.80124 1.541329 0.59763
H  -1.088588 2.272076 2.194371
H  0.562165 -0.328167 1.776116
H  0.488399 0.647253 3.274754
H  -2.519511 0.419035 2.795886
H  0.638335 -1.44184 -0.674816
H  4.674498 0.205367 -1.009445
H  -3.452456 1.528777 0.076464
H  -4.642581 0.69951 -0.991975
H  -3.325563 -3.624119 1.64156
H  -4.528165 -2.987531 0.462385
H  1.550784 -3.729784 -0.982403
H  5.58155 -2.119236 -1.331687
H  4.020661 -4.087333 -1.31812
H  -1.85152 1.737055 -1.898887
H  -3.061368 0.947294 -2.953105
H  -3.417245 2.556713 -2.250048
H  -4.932487 -3.117436 3.539485
H  -6.121609 -2.471639 2.365585
H  -5.701296 -4.214283 2.348527
H  2.110865 3.830896 -1.985751
H  2.786454 4.12076 -0.331697
H  3.893761 4.047586 -1.76007
