program: Gaussian 09
title: 000088907
version: EM64L-G09RevD.01
frameworkgroup: C1[X(C11H15NO2)]
method: RPBEPBE
basis: SDD
operation: Freq
keyword: #p
keyword: freq=noraman
keyword: PBEPBE/SDD
title: #p freq=noraman PBEPBE/SDD
converged: YES YES NO NO
title: Mulliken charges:
elementType: O O N C C C C C C C C C C C H H H H H H H H H H H H H H H
charge: -0.297141 -0.273288 -0.704867 0.045197 0.266331 0.328197 0.342359 -0.550114 -0.389213 -0.380931 -0.686155 -0.688979 0.177805 -0.841236 0.230735 0.259067 0.265356 0.209579 0.254995 0.218753 0.206865 0.233015 0.220956 0.225583 0.227048 0.226786 0.240181 0.310528 0.322589
chargesum: 0.00000
title: Mulliken charges with hydrogens summed into heavy atoms:
elementType: O O N C C C C C C C C C C C
charge: -0.297141 -0.273288 -0.071751 0.275931 0.266331 0.328197 0.342359 -0.291048 -0.123857 -0.155349 -0.002827 -0.028143 0.177805 -0.147221
polarizability: 2.05289021e+02 -1.11750335e+00 1.38089440e+02 -1.46292464e+00 -3.73811645e+00 7.77763195e+01
1716.lowfreq: -8.0305 -0.0008 -0.0002 0.0006 5.5755 10.1249 38.3887 50.5619 85.4419
frequency: 37.9190 50.4974 85.4283 93.7139 116.2065 182.3005 192.0364 205.0722 214.9175 237.6771 249.9291 282.1073 301.5372 330.6862 349.2351 386.0003 398.1398 408.7396 440.2992 452.9346 521.1136 540.2496 568.9459 620.5346 714.9361 736.1930 743.1103 772.3694 784.0792 830.9972 893.1198 907.8883 926.5217 932.9825 942.2386 956.8622 989.4785 1021.2728 1042.0824 1087.3486 1104.8527 1145.1989 1157.4284 1180.4708 1201.2095 1217.9300 1286.6081 1302.6592 1328.3932 1337.3147 1379.5860 1391.3718 1395.1922 1405.2270 1436.4446 1456.3605 1465.1890 1471.7449 1472.8552 1481.3150 1488.3538 1508.3864 1579.1554 1607.8632 1624.9093 1642.7789 2951.0652 2988.0724 2991.2596 3017.9220 3025.1485 3082.8443 3086.5194 3091.4170 3097.3196 3104.3745 3126.0849 3136.8094 3184.6017 3573.6933 3714.0510
redmass: 3.5851 3.2263 5.5646 3.9080 3.8749 1.0970 1.0255 3.1297 1.8835 3.0918 1.8196 2.7307 2.7113 1.2570 3.6925 3.6804 2.8066 1.2007 2.8374 2.7234 3.3993 5.6931 5.4361 6.0360 5.3326 2.7343 4.4364 7.2451 3.7839 1.3912 2.6866 1.5987 1.2336 3.1140 1.3997 1.3459 1.7009 1.8063 1.5278 2.0896 1.6970 1.3300 2.0523 2.0529 3.6523 2.3317 1.3108 2.4781 1.6723 1.3383 1.2624 1.4209 1.2315 4.4009 3.2939 1.0539 1.0482 1.0462 1.0498 1.2139 1.0496 3.2122 7.4580 10.1083 2.9626 1.4861 1.0395 1.0356 1.0359 1.0971 1.0863 1.0994 1.0954 1.0987 1.1004 1.1006 1.0899 1.0914 1.0944 1.0450 1.1036
irintensity: 1.5875 2.4217 0.8513 1.8530 0.3471 3.8911 0.0158 1.3757 4.1872 0.1694 5.5325 3.5847 1.3806 223.4416 7.1762 5.8140 20.9349 51.2073 2.2301 2.4296 1.8877 0.6965 0.1615 0.1805 13.0459 23.8009 0.6288 0.7358 3.6775 16.9017 5.3225 29.0325 5.1231 88.7151 3.7646 0.7013 45.7888 124.9212 6.1942 145.4028 73.8687 32.9865 12.4607 92.8560 77.2725 171.9138 18.0538 96.4036 23.6323 4.1813 35.1558 8.7118 18.0681 37.1017 103.1232 6.8971 6.9434 14.1139 4.8951 29.8798 23.3114 22.7735 102.6879 173.6065 1.6056 195.9626 46.0577 16.2625 29.4328 26.3622 7.4256 3.7037 15.2486 65.3008 25.3393 26.0317 22.4234 6.4278 2.3634 59.3167 22.6065
temp: 298.150 k
press: 1.00000 atm
elementType: 8 8 7 6 6 6 6 6 6 6 6 6 6 6 1 1 1 1 1 1 1 1 1 1 1 1 1 1 1
symmnumber: 1
zpe: 626769.5 jmol-1
zpe.correction: 0.238724 hartree
zpe.thermalcorrener: 0.253726 hartree
zpe.thermalcorrenthalpy: 0.254670 hartree
zpe.thermalcorrgfe: 0.196848 hartree
zpe.sumelectzpe: -632.342435 hartree
zpe.sumelectthermal: -632.327433 hartree
zpe.sumelectthermalent: -632.326489 hartree
zpe.sumelectthermalfe: -632.384311 hartree
dipole: -2.2928 -0.7232 0.2341
dipole: 2.4155
quadrupole: -56.0118 -81.0699 -87.0290
quadrupole: -7.3722 0.1113 -0.1643
quadrupole: 18.6918 -6.3663 -12.3254 -7.3722 0.1113 -0.1643
hfenergy: -632.5811592 hartree
pointgroup: C01 [X(C11H15N1O2)]
dipole: 0.903937 0.2912006 0.0350011 debye
polarizability: 205.1641496|-0.8610976|138.3128098|-4.3372248|0.4715827|77.6778208 unknown
InChI: InChI=1S/C11H15NO2/c1-7(2)14-11(13)9-5-4-8(3)10(12)6-9/h4-7H,12H2,1-3H3
charge 0 multiplicity 1
29 atoms
O  -2.139165 0.427233 0.092022
O  -1.518053 -1.821826 -0.004058
N  3.629169 -1.57941 -0.068423
C  -3.588935 0.018937 0.110036
C  0.203444 -0.089902 0.042123
C  2.91801 0.770543 0.036769
C  2.605365 -0.629451 -0.015059
C  1.248228 -1.041265 -0.011768
C  0.50242 1.295598 0.094088
C  1.853582 1.699645 0.090054
C  -3.98625 -0.340654 1.549339
C  -4.351353 1.213593 -0.467558
C  -1.195753 -0.604711 0.04191
C  4.36384 1.226737 0.033838
H  -3.68192 -0.872255 -0.538554
H  0.982593 -2.104238 -0.051371
H  -0.309268 2.025217 0.135363
H  -5.056892 -0.614055 1.588239
H  -3.397709 -1.199779 1.911934
H  -3.821371 0.519106 2.222967
H  -5.431386 0.983605 -0.51488
H  -3.99868 1.448404 -1.486374
H  -4.212886 2.108154 0.165154
H  2.095178 2.768741 0.129407
H  4.922618 0.827833 0.905243
H  4.897856 0.894878 -0.880161
H  4.43356 2.326286 0.074204
H  3.408486 -2.570028 -0.104916
H  4.605174 -1.302835 -0.071668
