program: Gaussian 09
title: 000088889
version: EM64L-G09RevD.01
frameworkgroup: C1[X(C14H17N)]
method: RPBEPBE
basis: SDD
operation: Freq
keyword: #pfreq=noraman
keyword: PBEPBE/SDD
title: #p freq=noraman PBEPBE/SDD
converged: YES YES NO NO
title: Mulliken charges:
elementType: N C C C C C C C C C C C C C C H H H H H H H H H H H H H H H H H
charge: -0.176347 -0.376425 -0.380812 -0.458259 -0.456990 0.416616 -0.539570 -0.586557 -0.587022 0.340774 0.369975 -0.438532 -0.438769 -0.256382 -0.253625 0.218019 0.234155 0.214204 0.235054 0.229632 0.222315 0.228385 0.223906 0.225983 0.232566 0.217707 0.220149 0.234061 0.225775 0.223944 0.218712 0.217359
chargesum: 0.00000
title: Mulliken charges with hydrogens summed into heavy atoms:
elementType: N C C C C C C C C C C C C C C
charge: -0.176347 0.075748 0.068445 -0.006312 -0.004699 0.416616 -0.081021 -0.148701 -0.352960 0.340774 0.369975 -0.212757 -0.214825 -0.037670 -0.036266
polarizability: 2.66075583e+02 9.93499912e+00 1.51645764e+02 3.17515693e+00 2.20490791e+00 8.92246691e+01
1716.lowfreq: -8.7068 -0.0008 -0.0006 0.0005 6.3237 18.6961 49.2105 73.1781 101.8475
frequency: 49.1149 72.8496 101.8461 136.0532 157.3611 186.6438 225.2249 244.5197 281.8973 303.2400 326.9285 412.9709 457.2325 470.0553 522.3909 550.3526 558.3903 572.4843 594.5778 687.1748 733.7647 742.3508 753.0569 770.8586 807.8227 832.2565 862.5867 868.1453 873.9525 917.1348 921.1468 926.0260 934.8612 941.3620 971.2666 986.2166 1018.6898 1035.2257 1042.2688 1063.2639 1108.8440 1119.6322 1146.8638 1163.5814 1168.4347 1170.5828 1178.4009 1206.8236 1211.1116 1222.0661 1228.5385 1242.2038 1278.8700 1306.0241 1312.9618 1314.9540 1329.9010 1338.8646 1345.0280 1359.1786 1391.3925 1410.5721 1447.0550 1450.2323 1459.2572 1467.8393 1473.9649 1487.8028 1493.8175 1501.5186 1570.6334 1609.0620 1621.5080 2928.9396 2937.0984 2944.2881 2959.1655 2996.1377 3008.0434 3015.5321 3029.7294 3034.6589 3043.0898 3077.4666 3090.4325 3106.0055 3111.0205 3130.5410 3133.6373 3154.4517
redmass: 3.7492 2.8130 3.6382 3.2765 2.7871 2.5845 2.7868 1.7020 4.5325 3.0335 3.9148 2.4987 3.5680 3.5821 3.8716 2.6651 4.6343 1.9416 4.9585 2.8794 1.9725 4.3394 1.6022 2.2555 1.4938 2.8253 1.7230 1.6521 1.7048 2.6868 1.8547 2.2499 1.4429 2.2973 1.3181 1.6791 2.1553 2.1379 2.4346 1.7658 1.6862 1.5788 1.5938 1.2635 1.0737 1.3653 2.4737 2.0305 1.4451 1.3870 1.4935 1.2639 1.5447 1.3506 1.2628 1.3768 1.4494 1.4672 1.5089 2.7116 3.3192 4.7451 2.5951 1.1624 1.1022 1.0888 1.0999 2.7554 1.0836 1.1085 6.5458 6.4554 6.6203 1.0678 1.0654 1.0680 1.0642 1.0910 1.0666 1.0699 1.0903 1.0935 1.0941 1.1006 1.1052 1.0860 1.0887 1.0926 1.0899 1.1001
irintensity: 0.8119 0.0793 0.3066 0.1317 0.2746 6.6786 0.8831 0.4227 0.2924 3.1109 1.0538 2.7216 3.2534 1.8445 0.3754 7.1526 1.0891 1.3874 2.4037 8.1654 23.3996 1.3287 30.9153 2.6629 65.9515 6.7880 4.4911 6.3372 10.6917 2.6258 7.9038 0.4361 5.9385 11.4725 0.2340 2.9221 3.0109 20.9621 1.2122 1.7950 7.9474 6.4513 11.3122 3.8850 1.4354 0.7917 17.7897 23.5290 4.9808 45.5765 26.6976 8.1355 5.2617 3.2235 1.1553 6.6175 4.8008 11.2523 1.7876 39.5433 9.7629 180.8928 42.1867 9.9513 24.0459 10.2834 19.6333 69.3792 1.9717 29.3580 128.1440 172.6697 353.4735 109.9762 41.0354 30.9974 38.7177 11.2198 18.7664 65.3067 43.4608 44.3428 36.6753 45.0869 55.4512 19.9262 2.4646 25.2876 45.2996 43.8431
temp: 298.150 k
press: 1.00000 atm
elementType: 7 6 6 6 6 6 6 6 6 6 6 6 6 6 6 1 1 1 1 1 1 1 1 1 1 1 1 1 1 1 1 1
symmnumber: 1
zpe: 722253.3 jmol-1
zpe.correction: 0.275092 hartree
zpe.thermalcorrener: 0.287790 hartree
zpe.thermalcorrenthalpy: 0.288734 hartree
zpe.thermalcorrgfe: 0.235921 hartree
zpe.sumelectzpe: -597.338695 hartree
zpe.sumelectthermal: -597.325997 hartree
zpe.sumelectthermalent: -597.325053 hartree
zpe.sumelectthermalfe: -597.377866 hartree
dipole: 4.5423 0.8718 -0.1061
dipole: 4.6264
quadrupole: -81.2086 -82.2411 -93.8297
quadrupole: -1.4346 0.1795 0.3220
quadrupole: 4.5512 3.5187 -8.0699 -1.4346 0.1795 0.3220
hfenergy: -597.613787 hartree
pointgroup: C01 [X(C14H17N1)]
dipole: -1.7884952 -0.3364719 -0.0337445 debye
polarizability: 266.1220888|9.4837691|151.5540071|-3.8782261|-2.4822413|89.2699195 unknown
InChI: InChI=1S/C14H17N/c1-2-6-13-11-14(8-7-12(13)5-1)15-9-3-4-10-15/h1-2,5-6,11H,3-4,7-10H2
charge 0 multiplicity 1
32 atoms
N  -2.236038 -0.007963 0.006315
C  -2.82862 1.326258 0.242592
C  -3.269542 -1.047478 -0.2167
C  -4.339135 1.040593 0.411387
C  -4.560755 -0.227364 -0.452078
C  -0.863289 -0.218078 -0.007135
C  -0.362223 -1.645387 -0.22669
C  0.997403 -1.875485 0.471076
C  0.063032 0.809079 0.10429
C  2.003398 -0.779723 0.153846
C  1.502216 0.557313 0.030891
C  3.387627 -1.026541 0.060059
C  2.436575 1.61592 -0.157257
C  4.306536 0.033498 -0.140371
C  3.821554 1.358926 -0.241008
H  -2.630948 2.002698 -0.617132
H  -2.383602 1.795411 1.142173
H  -3.379372 -1.707837 0.671221
H  -3.022725 -1.686783 -1.083888
H  -4.964526 1.891875 0.094309
H  -4.567007 0.822716 1.471009
H  -5.468294 -0.788721 -0.172614
H  -4.641177 0.04992 -1.519217
H  -1.093115 -2.382691 0.152114
H  -0.259077 -1.822941 -1.318312
H  1.397357 -2.869642 0.197769
H  0.823416 -1.888912 1.56919
H  -0.26642 1.8516 0.173903
H  3.756276 -2.056418 0.154389
H  2.065961 2.645054 -0.247206
H  5.380419 -0.171498 -0.212894
H  4.522197 2.189101 -0.389636
