program: Gaussian 09
title: 000088900
version: EM64L-G09RevD.01
frameworkgroup: C1[X(C15H24O)]
method: RPBEPBE
basis: SDD
operation: Freq
keyword: #pfreq=noraman
keyword: PBEPBE/SDD
title: #p freq=noraman PBEPBE/SDD
converged: YES YES NO NO
title: Mulliken charges:
elementType: O C C C C C C C C C C C C C C C H H H H H H H H H H H H H H H H H H H H H H H H
charge: -0.437361 0.416105 -0.192011 0.378395 -0.307063 -0.677679 -0.117879 -0.530656 -0.571305 -0.464666 0.439620 -0.793686 -0.806479 -0.434261 -0.772372 -0.515115 0.229147 0.257223 0.235936 0.216939 0.208717 0.222627 0.219857 0.220914 0.227482 0.216148 0.196591 0.216795 0.221459 0.220510 0.228614 0.214089 0.208853 0.211008 0.219135 0.215333 0.215727 0.230751 0.198848 0.333708
chargesum: 0.00000
title: Mulliken charges with hydrogens summed into heavy atoms:
elementType: O C C C C C C C C C C C C C C C
charge: -0.103653 0.416105 0.037136 0.378395 -0.049839 -0.224805 0.090838 -0.088172 -0.122908 -0.051926 0.439620 -0.134922 -0.154924 -0.223253 -0.122176 -0.085516
polarizability: 1.75492042e+02 6.94056553e+00 1.56194634e+02 2.30485870e+00 3.53527540e+00 1.31714093e+02
1716.lowfreq: -24.1882 -15.4408 0.0003 0.0004 0.0006 6.2672 52.1893 66.8676 105.9744
frequency: 52.0800 66.8060 105.8849 167.1737 187.9674 194.2902 200.7491 231.4282 242.8560 253.8287 260.6272 277.0266 300.3191 325.2226 329.8631 340.3528 372.5942 392.1300 428.6704 433.1774 465.5097 483.2120 525.2504 541.1631 564.6127 618.2602 623.2295 667.4145 718.9898 785.5907 820.6762 830.5682 841.8191 868.0717 905.8043 910.0104 921.2618 926.0096 933.7193 941.3827 947.6352 968.6152 977.7249 985.5957 1003.1638 1009.1834 1021.2433 1031.1014 1069.4410 1084.9309 1097.1595 1125.7421 1131.4644 1138.3678 1149.7418 1158.2713 1168.1039 1183.2700 1190.8050 1193.0634 1221.1591 1230.8647 1249.4750 1276.6848 1281.1741 1284.0800 1288.9199 1295.7922 1308.1938 1316.8194 1325.6575 1334.4389 1338.7035 1360.4343 1367.0816 1373.7207 1390.7759 1391.9462 1452.7829 1462.1903 1466.2541 1468.2577 1469.2404 1476.5952 1477.9676 1478.7982 1486.8604 1491.4245 1494.3387 1667.3941 2941.7945 2942.7121 2961.1418 2965.8735 2969.8855 2970.4891 2972.9336 2975.8488 2986.4411 2997.2352 2998.6938 3023.8593 3039.9926 3052.7810 3054.8734 3059.6669 3060.2162 3061.2269 3065.4368 3067.5387 3069.3704 3077.2636 3085.2874 3551.2489
redmass: 2.9737 4.4427 3.7654 2.3528 2.4519 2.6656 2.9507 1.3684 1.4007 1.8131 1.5120 1.4582 2.1311 1.9294 1.5787 2.2105 2.2465 1.9823 2.5074 2.3554 3.1341 2.6837 2.7476 2.9530 3.0626 3.9143 3.4907 3.2025 3.5335 3.1093 1.4981 1.5985 2.3672 2.4024 2.0575 2.1956 3.1217 1.9468 1.5545 1.4244 1.9423 1.7511 2.0541 1.4951 1.8501 1.4134 1.9226 1.9373 2.1806 1.8254 2.1708 2.4818 1.6027 1.5848 1.2219 1.7680 2.0769 2.4172 2.1640 1.6661 2.0234 1.6395 1.7813 1.5797 1.3287 1.3365 1.3089 1.5514 1.2921 1.4700 1.5412 1.5656 1.6025 1.7933 1.2168 1.2087 1.2144 1.2052 1.0867 1.0684 1.0841 1.0799 1.0582 1.0507 1.0648 1.0859 1.0525 1.0530 1.0746 6.8194 1.0797 1.0621 1.0666 1.0356 1.0557 1.0656 1.0563 1.0416 1.0974 1.0605 1.0609 1.0853 1.0996 1.0997 1.1031 1.1008 1.0984 1.0987 1.0985 1.0993 1.0989 1.0980 1.0907 1.0662
irintensity: 0.0285 2.6947 1.1520 0.1653 2.3886 1.3192 0.1724 0.2356 0.7392 0.5391 0.2752 0.1408 1.0841 3.7145 75.5364 2.5424 33.8783 46.6566 13.3634 1.3051 11.1349 0.8028 4.1270 0.9413 1.1643 1.0596 1.1926 10.0451 0.0963 2.0323 15.3448 9.0426 2.1248 0.6556 19.5867 6.7632 51.0040 19.6394 0.9681 3.2185 2.8370 2.8487 2.1433 0.8619 19.4499 3.4636 5.0795 3.7413 1.1271 4.3684 2.3798 0.5084 6.6796 4.4485 15.0015 0.6781 13.9745 0.8384 5.4024 0.8919 1.5333 5.1596 1.1515 8.0158 1.5475 6.5859 3.9768 5.6059 9.4080 1.8746 0.4575 0.6072 1.4698 3.0028 27.7541 18.9171 14.5668 15.6688 10.3795 6.0318 5.0681 6.3835 2.6791 9.4423 6.2656 8.7576 8.1584 14.8383 14.9809 5.3713 24.8220 27.0111 63.1698 38.4833 12.7068 20.9407 85.7903 13.0723 31.7456 36.3026 27.4513 25.0761 42.4014 7.7292 36.8866 37.0875 44.1377 30.2678 50.7464 48.1458 58.8270 44.8427 35.5100 4.3429
temp: 298.150 k
press: 1.00000 atm
elementType: 8 6 6 6 6 6 6 6 6 6 6 6 6 6 6 6 1 1 1 1 1 1 1 1 1 1 1 1 1 1 1 1 1 1 1 1 1 1 1 1
symmnumber: 1
zpe: 934104.4 jmol-1
zpe.correction: 0.355782 hartree
zpe.thermalcorrener: 0.371553 hartree
zpe.thermalcorrenthalpy: 0.372498 hartree
zpe.thermalcorrgfe: 0.314777 hartree
zpe.sumelectzpe: -659.934375 hartree
zpe.sumelectthermal: -659.918603 hartree
zpe.sumelectthermalent: -659.917659 hartree
zpe.sumelectthermalfe: -659.975379 hartree
dipole: -2.0303 -0.7840 -0.6739
dipole: 2.2784
quadrupole: -110.7135 -95.1532 -98.3200
quadrupole: -1.9212 -3.7097 0.0978
quadrupole: -9.3179 6.2424 3.0756 -1.9212 -3.7097 0.0978
hfenergy: -660.2901564 hartree
pointgroup: C01[X(C15H24O1)]
dipole: -0.7927061 -0.3291955 -0.2583472 debye
polarizability: 175.1691314|7.4348378|156.5816324|1.9035412|3.4080897|131.6500047 unknown
InChI: InChI=1S/C15H24O/c1-10-4-5-13-14(2,3)12-8-15(10,13)7-6-11(12)9-16/h6,10,12-13,16H,4-5,7-9H2,1-3H3
charge 0 multiplicity 1
40 atoms
O  4.068439 -0.901441 0.742364
C  -0.995787 -0.569527 0.15066
C  -0.821282 0.829309 -0.580112
C  0.482154 1.507627 0.010164
C  1.178665 0.269518 0.718113
C  -0.026796 -0.459144 1.364388
C  -2.523085 -0.672151 0.503487
C  -2.195151 1.541776 -0.456209
C  -0.45755 -1.70757 -0.761743
C  -3.200902 0.364464 -0.437253
C  1.817329 -0.686385 -0.293453
C  0.196378 2.608716 1.065938
C  1.336518 2.144316 -1.11348
C  1.04607 -1.595144 -0.958564
C  -3.164287 -2.072276 0.456192
C  3.31369 -0.618502 -0.505525
H  -0.640525 0.640566 -1.657661
H  1.941741 0.597631 1.448284
H  0.251873 -1.442996 1.785186
H  -0.474862 0.140628 2.17738
H  -2.638964 -0.287567 1.540231
H  -2.382498 2.257296 -1.27747
H  -2.273452 2.101461 0.494743
H  -0.966029 -1.68198 -1.749011
H  -0.689443 -2.704186 -0.329675
H  -4.20885 0.657569 -0.088369
H  -3.312471 -0.064265 -1.454552
H  1.150204 2.99517 1.4723
H  -0.344449 3.460435 0.613503
H  -0.406959 2.243244 1.915225
H  1.576598 1.411117 -1.904522
H  0.787618 2.980778 -1.586636
H  2.286407 2.551787 -0.717053
H  1.515462 -2.291588 -1.670252
H  -3.125924 -2.506881 -0.559914
H  -2.664417 -2.77745 1.146743
H  -4.22921 -2.017398 0.751113
H  3.64548 0.400076 -0.770689
H  3.625528 -1.314796 -1.312391
H  3.758943 -1.776338 1.09142
