program: Gaussian 09
title: 000088877
version: EM64L-G09RevD.01
frameworkgroup: C1[X(C8H8N2O2)]
method: RPBEPBE
basis: SDD
operation: Freq
keyword: #pfreq=noraman
keyword: PBEPBE/SDD
title: #p freq=noraman PBEPBE/SDD
converged: YES YES NO NO
title: Mulliken charges:
elementType: O O N N C C C C C C C C H H H H H H H H
charge: -0.248342 -0.232525 -0.421959 -0.051472 0.360460 -0.009023 -0.320524 -0.265277 -0.200172 -0.221338 0.217065 -0.788218 0.318503 0.354701 0.273969 0.237995 0.240238 0.245278 0.266968 0.243671
chargesum: 0.00000
title: Mulliken charges with hydrogens summed into heavy atoms:
elementType: O O N N C C C C C C C C
charge: -0.248342 -0.232525 -0.067258 -0.051472 0.360460 -0.009023 -0.002020 0.008693 0.037823 0.018900 0.217065 -0.032301
polarizability: 1.57769227e+02 4.38010048e+00 1.43222518e+02 -1.80532923e-02 1.51845994e-02 4.75685923e+01
1716.lowfreq: -42.8828 -10.7827 -0.0009 -0.0006 -0.0004 3.4668 11.1883 76.7253 88.6142
frequency: -42.8554 76.7251 88.5984 138.3361 138.9009 224.7897 232.1383 282.1079 311.8218 338.9465 453.6193 478.8188 518.8001 523.3132 583.3736 619.0130 688.2857 741.8719 779.7686 803.0732 826.3486 854.7869 900.6769 931.3405 982.4084 987.6623 1008.4161 1023.1643 1034.3966 1087.5862 1149.0525 1178.5955 1217.1573 1225.5456 1308.5187 1341.2308 1378.5194 1384.0557 1429.2585 1450.3973 1465.0020 1470.6110 1504.4194 1582.0332 1606.1734 1632.2495 2991.8275 3076.5775 3139.4185 3139.5639 3151.0740 3169.5199 3200.4992 3392.8106
redmass: 1.0507 5.4731 4.2143 5.3144 5.1027 7.8481 9.3781 4.4153 5.2202 5.0887 3.4327 7.8530 3.1317 4.5311 2.9564 6.7290 5.9719 4.3098 1.2667 6.6517 4.7778 1.1477 1.3854 6.2138 1.3509 1.6841 1.3282 1.9950 1.6840 2.4734 1.7708 1.4295 1.5803 2.9429 1.7614 8.2882 1.2696 3.8643 2.8720 1.1973 1.0478 2.7106 2.3794 4.9230 5.7133 5.6744 1.0383 1.0980 1.0877 1.0973 1.0908 1.0990 1.0954 1.0768
irintensity: 0.9583 12.0455 0.0039 14.8209 0.0931 0.1442 0.3313 0.2693 0.5751 3.8211 6.0266 0.1813 8.9125 11.6296 0.3300 16.3127 5.0341 0.0076 85.7987 13.2958 0.7475 77.9911 2.9027 10.9758 4.6275 26.7025 3.8339 13.3191 10.8091 20.4547 164.8965 38.4211 23.9781 87.4332 88.6339 200.6901 30.9789 276.5421 26.2928 17.8465 20.2021 103.7947 380.5346 197.0154 52.2878 121.2395 3.9415 11.1086 2.0214 10.7923 2.8639 18.8364 7.3181 46.8128
temp: 298.150 k
press: 1.00000 atm
elementType: 8 8 7 7 6 6 6 6 6 6 6 6 1 1 1 1 1 1 1 1
symmnumber: 1
zpe: 390241.0 jmol-1
zpe.correction: 0.148635 hartree
zpe.thermalcorrener: 0.158790 hartree
zpe.thermalcorrenthalpy: 0.159734 hartree
zpe.thermalcorrgfe: 0.112481 hartree
zpe.sumelectzpe: -568.689732 hartree
zpe.sumelectthermal: -568.679577 hartree
zpe.sumelectthermalent: -568.678633 hartree
zpe.sumelectthermalfe: -568.725885 hartree
dipole: -0.0118 -1.1027 0.0184
dipole: 1.1029
quadrupole: -64.4782 -74.8205 -70.8122
quadrupole: -18.0885 -0.0451 -0.0083
quadrupole: 5.5588 -4.7835 -0.7753 -18.0885 -0.0451 -0.0083
hfenergy: -568.8383665 hartree
pointgroup: C01 [X(C8H8N2O2)]
dipole: -0.0083515 0.4328327 0.0293419 debye
dipolederiv: -0.8193465 -0.013756 0.0036905 -0.5810867 -0.8526903 -0.0190436 -0.025388 -0.0243587 -0.3366121 -0.5653182 -0.8153705 -0.0382283 -0.1624504 -0.9404164 -0.0385082 -0.0044678 -0.0322379 -0.1627025 -2.2825293 -0.1369555 0.011264 0.132865 -0.2977014 -0.0029145 0.024865 0.0004881 -0.2751798 0.1639041 0.4392469 0.0196428 0.3368944 1.4930482 0.0820178 0.0137945 0.0806565 -0.1625724 1.2571992 0.1259154 -0.0041715 -0.9314179 0.357524 0.0205097 -0.0582295 0.0107562 0.1337087 -0.1545041 0.3971223 0.022248 -0.3637871 -1.0434762 -0.0529951 -0.0160234 -0.0595402 0.0495891 -0.4163186 0.1390874 0.0092482 0.6530267 -0.1640443 -0.0052123 0.0353053 -0.000812 -0.1785979 -0.0730522 -0.3110302 -0.0158445 0.2595344 0.2770478 0.0148396 0.0136118 0.0200228 -0.0544855 0.4904107 0.2107447 0.0054615 -0.0025647 0.2993003 0.0201671 -0.0056293 0.0180322 -0.0890289 -0.0797899 -0.2339343 -0.0130333 -0.3829363 -0.4499368 -0.010413 -0.0209979 -0.0119207 -0.1790918 2.2433857 0.0867173 -0.012689 0.7112365 1.0778578 0.0350276 0.0232486 0.0398019 0.1844061 -0.3037892 0.1663232 0.0107744 0.3264616 -0.2167282 -0.012366 0.0097429 -0.0079294 0.0428833 0.1181524 -0.0700254 -0.0028997 -0.0209441 0.1064473 -0.0039783 -0.0003324 -0.0033352 0.1852768 0.2673411 -0.0204335 -0.0007414 0.0824483 0.1810371 -0.0056989 0.004226 -0.0052066 0.2803032 0.0418878 -0.0066458 0.0006814 -0.0914625 0.0697408 -0.0037561 -0.003656 -0.0045269 0.1583939 0.0950594 0.0229525 0.0016916 0.0329491 -0.0884114 -0.0125908 0.0023365 -0.0123218 0.1484037 -0.0735025 0.0805912 0.0063478 0.0761724 0.0453026 -0.0067966 0.0062107 -0.0068665 0.1625604 0.0698376 -0.0103385 0.0513494 0.0150324 0.0380349 0.0904973 0.0088434 0.102747 -0.0156258 -0.046204 -0.0369725 0.003557 -0.1006434 0.0602547 0.0002954 0.0034754 -0.0024407 0.1322717 0.0671765 -0.0132387 -0.058349 0.0106723 0.0478096 -0.0890811 -0.0109358 -0.1010081 -0.0239001 unknown
polarizability: 157.4841879|4.8522935|143.2570676|-0.7281618|4.8109225|47.8190821 unknown
InChI: InChI=1S/C8H8N2O2/c1-6(11)9-7-4-2-3-5-8(7)10-12/h2-5,9H,1H3
charge 0 multiplicity 1
20 atoms
O  2.775993 1.39159 0.019579
O  -1.877066 -2.802755 -0.148134
N  1.283019 -0.419225 -0.055484
N  -0.857541 -2.013644 -0.11713
C  0.040627 0.230611 -0.010798
C  -1.132976 -0.608161 -0.042723
C  -0.12839 1.641616 0.063867
C  -2.438439 -0.044659 -0.001745
C  -1.430386 2.174883 0.1038
C  -2.589539 1.345306 0.07151
C  2.567991 0.146769 -0.038828
C  3.687976 -0.886517 -0.096123
H  0.753857 2.282685 0.088432
H  1.192487 -1.44575 -0.105544
H  -3.293811 -0.728553 -0.029375
H  -1.550895 3.262596 0.161177
H  -3.586187 1.796645 0.104157
H  3.652846 -1.558715 0.781039
H  4.653758 -0.362015 -0.104742
H  3.609375 -1.511508 -1.004632
