program: Gaussian 09
title: 000088921
version: EM64L-G09RevD.01
frameworkgroup: C1[X(C7H16O6S3)]
method: RPBEPBE
basis: SDD
operation: Freq
keyword: #p
keyword: freq=noraman
keyword: PBEPBE/SDD
title: #p freq=noraman PBEPBE/SDD
converged: YES YES NO NO
title: Mulliken charges:
elementType: S S S O O O O O O C C C C C C C H H H H H H H H H H H H H H H H
charge: 0.945177 0.944215 0.944119 -0.555130 -0.517364 -0.517596 -0.554611 -0.517943 -0.554765 -0.699615 -0.521789 -0.521795 -0.521256 -0.625204 -0.625252 -0.625690 0.374075 0.292378 0.316299 0.292451 0.316492 0.292300 0.315805 0.233730 0.290866 0.249795 0.233946 0.290883 0.249972 0.233718 0.291378 0.250410
chargesum: 0.00000
title: Mulliken charges with hydrogens summed into heavy atoms:
elementType: S S S O O O O O O C C C C C C C
charge: 0.945177 0.944215 0.944119 -0.555130 -0.517364 -0.517596 -0.554611 -0.517943 -0.554765 -0.325540 0.086888 0.087149 0.086849 0.149188 0.149549 0.149816
polarizability: 2.07270800e+02 -3.76632081e-02 2.07195862e+02 -2.07871091e-02 1.02051518e-02 1.49019232e+02
1716.lowfreq: -8.3368 -5.6353 0.0014 0.0018 0.0026 10.5426 34.3200 38.2906 44.4964
frequency: 34.2359 38.1852 44.2213 77.6504 83.0474 88.4621 104.6010 107.1441 109.1969 146.6727 151.8440 153.8032 169.0960 170.1454 172.1408 173.7844 185.0094 186.5132 202.9035 205.6222 208.4423 268.5679 272.7475 272.7878 335.1156 336.9641 365.7387 383.8674 384.4660 403.5241 461.2514 463.1321 479.9368 562.5680 575.9374 577.5149 780.1462 781.0733 784.6616 795.8198 803.6699 804.7530 895.6236 896.2005 919.2251 958.7927 959.1588 964.0819 1032.8372 1034.5124 1039.4288 1065.5125 1066.6141 1074.6026 1079.4348 1081.4292 1222.4247 1225.1397 1226.4384 1257.6830 1260.6384 1262.4260 1394.8250 1397.2069 1398.5072 1429.1011 1430.0940 1431.1994 1447.5875 1451.1295 1452.6315 1479.6118 1480.1788 1481.1715 2987.1297 2987.3945 2987.5680 3004.6637 3005.6976 3008.1484 3082.0888 3082.2298 3082.4465 3098.7913 3105.9884 3106.0143 3106.7180 3125.7619 3126.2211 3126.3823
redmass: 5.8826 6.6898 4.5338 2.8135 3.3086 3.8179 4.1225 5.1002 4.9919 1.7384 2.0348 1.9441 7.2867 8.6531 9.9343 4.6585 4.2427 4.5097 1.6916 1.5717 1.5668 6.0074 5.9383 6.0908 8.4886 8.6500 6.2030 4.8084 4.8012 5.5893 6.5570 6.3150 8.0120 6.8908 8.1723 8.1325 2.5022 2.5239 4.3987 1.3893 1.8317 1.8277 7.1619 7.1161 5.6129 1.5855 1.5841 1.8303 1.2055 1.2116 1.2407 1.4563 1.4789 2.6318 1.8999 1.8711 1.2821 1.2759 1.2764 1.1904 1.1898 1.1899 1.1701 1.1644 1.1647 1.1045 1.1045 1.1027 1.0325 1.0336 1.0347 1.0574 1.0569 1.0571 1.0390 1.0391 1.0392 1.0605 1.0603 1.0600 1.0943 1.0944 1.0941 1.0865 1.1061 1.1061 1.1059 1.1052 1.1050 1.1054
irintensity: 1.5140 0.4462 5.8455 1.1493 2.4774 2.4234 0.8375 3.7164 3.7853 2.7958 3.1013 2.0423 2.4303 1.1810 1.4942 0.5210 3.3007 2.7050 3.3399 3.4414 5.9854 1.1343 52.5394 54.5360 32.1117 31.8625 2.5508 10.0010 10.8478 0.9811 22.3560 21.5638 0.3247 1.8718 89.6275 90.6043 49.0471 48.6218 1.8443 0.1689 68.7819 70.1562 1.7446 1.6583 150.2217 65.6292 65.3634 31.0007 13.2565 11.1931 1.8042 2.0918 1.8729 0.6994 12.3231 12.9188 15.3866 15.4477 7.3947 1.7441 14.1941 14.1080 31.3211 31.7158 53.2776 17.8574 12.9190 12.6119 14.6996 14.4403 14.2247 8.8592 9.6686 9.6877 9.0430 8.1897 6.9083 9.7865 12.9655 11.2339 3.0388 3.7042 4.0819 12.8028 3.8726 4.4552 3.5675 0.1852 0.1842 0.4600
temp: 298.150 k
press: 1.00000 atm
elementType: 16 16 16 8 8 8 8 8 8 6 6 6 6 6 6 6 1 1 1 1 1 1 1 1 1 1 1 1 1 1 1 1
symmnumber: 1
zpe: 607258.3 jmol-1
zpe.correction: 0.231292 hartree
zpe.thermalcorrener: 0.254215 hartree
zpe.thermalcorrenthalpy: 0.255159 hartree
zpe.thermalcorrgfe: 0.179061 hartree
zpe.sumelectzpe: -1920.055500 hartree
zpe.sumelectthermal: -1920.032577 hartree
zpe.sumelectthermalent: -1920.031633 hartree
zpe.sumelectthermalfe: -1920.107731 hartree
dipole: 0.0250 -0.0039 -1.0572
dipole: 1.0575
quadrupole: -112.2087 -112.0841 -135.5309
quadrupole: 0.0051 0.0671 -0.0832
quadrupole: 7.7326 7.8572 -15.5897 0.0051 0.0671 -0.0832
hfenergy: -1920.2867924 hartree
pointgroup: C01 [X(C7H16O6S3)]
dipole: -0.009339 -0.0005955 0.4159524 debye
polarizability: 207.2843509|0.0146291|207.1812886|-0.0996145|0.2237703|149.0202542 unknown
InChI: InChI=1S/C7H16O6S3/c1-4-14(8,9)7(15(10,11)5-2)16(12,13)6-3/h7H,4-6H2,1-3H3
charge 0 multiplicity 1
32 atoms
S  1.90652 0.082605 0.618518
S  -0.883919 -1.69597 0.617295
S  -1.031275 1.612405 0.628138
O  2.471531 1.036481 1.837339
O  2.0281 0.616933 -0.914701
O  -0.475063 -2.062128 -0.915685
O  -0.337318 -2.662788 1.834543
O  -1.551149 1.457054 -0.907094
O  -2.143557 1.61314 1.844232
C  -0.003284 -0.000002 1.12679
C  2.663747 -1.749687 0.798618
C  -2.849521 -1.439336 0.797358
C  0.169894 3.188651 0.81907
C  2.881922 -2.338169 -0.58356
C  -3.466079 -1.314559 -0.584336
C  0.603751 3.655007 -0.558993
H  -0.001128 -0.003756 2.230468
H  3.574553 -1.512866 1.373514
H  1.904763 -2.269614 1.41166
H  -3.100763 -2.353833 1.360141
H  -2.920101 -0.530051 1.422084
H  -0.506429 3.86506 1.367986
H  0.983665 2.800216 1.458217
H  3.34899 -3.334023 -0.451279
H  1.927381 -2.475385 -1.117819
H  3.55505 -1.71906 -1.1985
H  -4.562369 -1.224381 -0.452698
H  -3.107336 -0.410968 -1.104224
H  -3.264296 -2.197771 -1.211905
H  1.224821 4.562276 -0.423356
H  1.21569 2.892404 -1.06848
H  -0.255393 3.915317 -1.198339
