program: Gaussian 09
title: 000088864
version: EM64L-G09RevD.01
frameworkgroup: C1[X(C11H12O2)]
method: RPBEPBE
basis: SDD
operation: Freq
keyword: #pfreq=noraman
keyword: PBEPBE/SDD
title: #p freq=noraman PBEPBE/SDD
converged: YES YES NO NO
title: Mulliken charges:
elementType: O O C C C C C C C C C C C H H H H H H H H H H H H
charge: -0.253003 -0.195321 0.203012 -0.502842 -0.534339 0.422423 -0.724332 0.176653 -0.411048 -0.381993 -0.236779 -0.219371 -0.241020 0.239893 0.237599 0.263781 0.263876 0.232162 0.248172 0.217323 0.228065 0.277452 0.227227 0.230805 0.231605
chargesum: 0.00000
title: Mulliken charges with hydrogens summed into heavy atoms:
elementType: O O C C C C C C C C C C C
charge: -0.253003 -0.195321 0.203012 -0.025350 -0.006682 0.422423 -0.026675 0.176653 -0.182984 -0.104541 -0.009552 0.011434 -0.009415
polarizability: 1.42629032e+02 -2.21499210e-01 1.18557980e+02 -5.78906368e+00 9.17580255e+00 8.58138661e+01
1716.lowfreq: -17.9138 -8.3034 -0.0006 -0.0005 0.0003 11.6039 41.8264 61.2437 108.0291
frequency: 41.5615 61.2390 108.0108 159.0977 199.8591 214.6075 284.3166 293.0334 330.0407 368.7931 403.1719 481.5723 496.6223 525.6534 551.9187 612.4129 617.1757 637.8765 709.4006 719.2962 770.2052 777.2664 847.9354 858.3390 863.8675 904.5282 929.5624 981.8095 989.4920 1002.5844 1007.9361 1015.0509 1025.1710 1066.0357 1076.8014 1093.3346 1100.5449 1135.2528 1173.5348 1185.0517 1191.1663 1219.3018 1261.3688 1291.3044 1311.3092 1315.9755 1379.0318 1388.6461 1433.1680 1444.6962 1455.6280 1468.8459 1471.2818 1482.9015 1590.5237 1612.5428 1706.3640 2993.5601 3018.0877 3021.7372 3091.8787 3096.3419 3104.4233 3107.2356 3114.4196 3130.0854 3142.3938 3159.2472 3171.6581
redmass: 3.8255 6.6396 3.6218 2.7197 1.2694 2.4257 2.5394 2.9051 5.6669 4.4661 2.8665 4.0535 3.1551 3.1098 3.3875 5.1287 4.6198 5.6895 1.7437 4.0797 2.0784 3.0067 2.0402 1.2498 4.6817 2.0544 1.3959 1.3724 6.0344 1.3289 1.8449 1.7748 2.4295 1.9128 2.1386 2.8451 2.0660 1.5075 1.0521 3.2505 1.1261 1.5919 2.2675 1.5450 1.4831 1.3460 7.8664 1.2131 2.2116 1.0803 1.0635 1.0714 1.1871 1.8546 6.1603 6.0612 12.6034 1.0355 1.0654 1.0632 1.0998 1.0986 1.1007 1.1009 1.0872 1.0869 1.0930 1.0965 1.0983
irintensity: 1.3161 0.3773 5.1910 3.6002 0.3946 0.1928 0.2906 0.3798 1.3449 1.3231 0.0219 9.0039 1.9424 3.1169 8.2439 3.2695 2.2782 10.9355 51.5452 4.9834 44.6427 7.0040 30.1734 0.2295 77.0587 10.3492 4.3030 0.0136 0.3564 0.1163 13.1455 34.5305 11.7553 45.3886 74.1824 131.1852 8.0344 1.2908 0.1905 42.6616 1.2632 12.5861 27.0733 14.5806 6.7266 2.3029 1.2222 18.7342 12.3570 18.0556 1.0798 20.6334 1.7720 19.9818 0.6382 4.1068 356.6402 13.9220 5.2953 27.2644 15.5330 14.4278 6.2403 39.4672 8.9045 1.2539 27.6949 21.5853 10.7573
temp: 298.150 k
press: 1.00000 atm
elementType: 8 8 6 6 6 6 6 6 6 6 6 6 6 1 1 1 1 1 1 1 1 1 1 1 1
symmnumber: 1
zpe: 531112.6 jmol-1
zpe.correction: 0.202290 hartree
zpe.thermalcorrener: 0.213636 hartree
zpe.thermalcorrenthalpy: 0.214580 hartree
zpe.thermalcorrgfe: 0.164613 hartree
zpe.sumelectzpe: -575.879763 hartree
zpe.sumelectthermal: -575.868417 hartree
zpe.sumelectthermalent: -575.867473 hartree
zpe.sumelectthermalfe: -575.917441 hartree
dipole: -2.8447 3.5692 2.0704
dipole: 5.0118
quadrupole: -80.8029 -75.2141 -76.4614
quadrupole: 11.3309 2.9488 1.0667
quadrupole: -3.3101 2.2787 1.0314 11.3309 2.9488 1.0667
hfenergy: -576.0820536 hartree
pointgroup: C01 [X(C11H12O2)]
dipole: 1.1328054 1.3816674 -0.8340608 debye
dipolederiv: -1.0333497 -0.4492913 -0.1861529 -0.4882747 -0.7284432 -0.148477 -0.5178451 -0.3578486 -0.6585137 -0.8374419 -0.4288472 -0.0393714 -0.5743895 -0.805108 0.0069037 0.0387897 0.1005718 -0.470008 0.7348361 0.1052833 0.0616247 0.290366 0.502851 0.1362901 -0.1134464 -0.0218638 0.3009884 0.0147223 -0.043362 -0.0901578 -0.0299093 0.0172444 -0.0345148 0.0051973 0.028393 -0.0718987 0.0498605 -0.1199911 0.0344466 -0.0890871 -0.0485312 0.1607501 0.013683 0.1098003 -0.2884547 0.1083286 -0.0968779 -0.0407234 -0.1508352 -0.0799308 -0.0317283 -0.0757822 0.0256124 -0.1080599 -0.1021483 0.0405382 0.0120234 -0.0440435 -0.0512225 -0.0648069 -0.0297557 -0.0770589 -0.0276957 1.242455 0.8275641 0.1917756 0.9443501 1.0094994 -0.044235 0.5797415 0.2028943 0.9932464 -0.1455824 -0.0267572 -0.0076389 -0.0012895 0.0412418 -0.0621435 -0.0095568 -0.0694668 -0.1174513 -0.1201862 0.0802805 -0.0547644 0.0640338 -0.0636909 -0.0383866 -0.0302347 -0.0571623 -0.0863722 0.0249991 0.0393078 -0.0840063 0.0719921 -0.0051989 -0.0844072 -0.0818355 -0.0742047 -0.085803 -0.0315901 -0.0508331 -0.0086794 -0.0507575 0.1046857 -0.0959365 -0.0086728 -0.0890935 -0.0936588 0.0472278 -0.0679917 -0.0472658 -0.0790592 -0.0674222 -0.0194987 -0.0310814 -0.0202065 -0.1395684 0.02616 -0.0941192 0.103992 -0.0737146 0.033667 0.0398788 0.1067016 0.0397046 0.0160355 -0.0794685 0.1267696 0.000692 0.0928168 -0.0507031 -0.033226 0.0127661 -0.0486024 0.0719637 0.0526328 0.0581562 0.0829066 0.0470215 -0.0012796 -0.0390134 0.0588854 -0.039718 0.0718853 -0.0443045 0.0022364 -0.1109991 -0.0085118 0.0846747 0.0106471 -0.0781661 -0.0001574 0.0552685 -0.1242266 0.1026391 0.0472716 0.1038266 0.0480816 -0.0339335 0.0363966 -0.0403678 0.0768653 0.0820182 0.0246029 -0.0783321 0.0187363 0.0664819 0.0751244 -0.0885192 0.0206019 -0.0570753 0.0279342 -0.1097488 0.0375687 -0.1159717 -0.0232651 0.0186223 0.0406676 0.0784644 0.0498327 0.088226 0.0738593 -0.0122283 0.0699705 -0.0766702 0.0713865 -0.0149626 0.0711975 0.1047368 0.0818906 -0.0553688 0.0626314 -0.0718986 0.0654635 0.0330834 0.0544615 0.0452467 0.1102629 -0.0300518 -0.0662022 0.0802178 -0.0783028 0.0318792 0.0785899 0.0907163 0.0749233 0.0958561 0.0645689 0.0466905 0.00327 0.0674309 -0.0756107 0.0856207 -0.0043951 0.0856649 0.115639 -0.0975101 0.0814629 0.0418994 0.0855003 0.0713063 0.0134104 0.046247 0.0126755 0.1419791 unknown
polarizability: 142.6395038|-0.0815239|118.2817008|-5.8327379|-9.5973025|86.0796738 unknown
InChI: InChI=1S/C11H12O2/c1-11(8-7-10(12)13-11)9-5-3-2-4-6-9/h2-6H,7-8H2,1H3
charge 0 multiplicity 1
25 atoms
O  -1.624761 -0.200944 0.901306
O  -3.172489 -1.704549 0.041041
C  -0.708397 0.874446 0.366193
C  -1.402649 1.291237 -0.970899
C  -2.074614 -0.011104 -1.449354
C  0.688714 0.268929 0.146481
C  -0.684426 1.98621 1.425912
C  -2.390932 -0.760804 -0.150742
C  1.691993 1.035458 -0.502151
C  1.016104 -1.024418 0.621309
C  2.991014 0.514254 -0.684981
C  2.316863 -1.547057 0.436478
C  3.308387 -0.782703 -0.217743
H  -0.683752 1.699588 -1.69775
H  -2.166724 2.060949 -0.760204
H  -1.385196 -0.635639 -2.047832
H  -2.995031 0.133539 -2.035642
H  -1.707726 2.34807 1.625245
H  -0.250661 1.61227 2.368148
H  -0.069116 2.834031 1.075335
H  1.46498 2.045714 -0.865613
H  0.251919 -1.612327 1.138348
H  3.753679 1.118182 -1.189365
H  2.553326 -2.551024 0.806261
H  4.315693 -1.189108 -0.36078
