program: Gaussian 09
title: 000088865
version: EM64L-G09RevD.01
frameworkgroup: C1[X(C6H17NOSi2)]
method: RPBEPBE
basis: SDD
operation: Freq
keyword: #p
keyword: freq=noraman
keyword: PBEPBE/SDD
title: #p freq=noraman PBEPBE/SDD
converged: NO YES NO NO
title: Mulliken charges:
elementType: Si Si O N C C C C C C H H H H H H H H H H H H H H H H H
charge: 1.092680 1.158153 -0.314249 -0.954053 -1.007800 -1.007863 -1.020724 -1.020657 0.341716 -0.771900 -0.086503 -0.122149 0.247534 0.241280 0.249541 0.241259 0.247531 0.249508 0.236118 0.281315 0.231804 0.236058 0.231668 0.281604 0.238923 0.238707 0.260500
chargesum: 0.00000
title: Mulliken charges with hydrogens summed into heavy atoms:
elementType: Si Si O N C C C C C C
charge: 1.006177 1.036004 -0.314249 -0.954053 -0.269445 -0.269565 -0.271487 -0.271327 0.341716 -0.033771
polarizability: 1.33434871e+02 2.12181889e+00 1.21729127e+02 1.42567151e-02 6.60101742e-03 1.11244508e+02
1716.lowfreq: -10.8430 -9.2044 -8.6317 -0.0012 -0.0010 0.0005 29.5310 54.6857 79.1309
frequency: 28.5206 54.4785 79.0958 114.9705 123.9587 128.1680 128.8434 134.1789 141.0259 141.4651 155.7927 182.3265 189.9848 200.9814 234.8177 285.7224 343.6493 375.0298 423.9635 551.6935 586.5100 639.3561 646.1740 653.1730 672.6834 709.4638 720.1523 735.2132 766.8362 816.8104 836.1928 859.5420 905.1192 909.5825 913.2117 922.8700 932.9029 947.8575 997.8627 1008.4253 1033.3307 1293.4920 1300.4193 1302.3819 1310.9572 1315.9513 1376.5266 1436.4666 1439.2542 1441.6367 1445.3238 1448.3768 1450.1461 1456.8260 1458.8976 1465.2976 1466.4946 1556.7205 2066.1045 2124.9823 2987.3277 2987.9383 2991.9515 2992.6308 2996.9459 3083.9169 3089.1509 3090.7266 3090.8469 3091.8068 3099.1360 3099.3711 3119.3760 3120.0123 3130.7721
redmass: 2.6808 2.9680 3.2866 1.4654 1.0458 3.0668 1.0597 1.0824 1.7557 1.0532 2.9176 2.5467 3.4645 3.0458 3.3618 3.7100 4.9569 3.6313 5.9391 3.7661 2.8801 3.7357 1.0677 3.5789 1.0860 2.8135 2.6442 1.3876 1.2622 1.4853 1.5424 2.6889 1.4097 1.3986 1.2485 1.3500 1.2447 1.3751 3.7548 2.0233 1.7244 1.2022 1.2173 1.2002 1.1914 5.2617 1.2705 1.0504 1.1394 1.0516 1.0467 1.0530 1.0473 1.0541 1.0487 1.0486 1.0503 5.9062 1.0387 1.0408 1.0345 1.0343 1.0347 1.0345 1.0373 1.0975 1.0980 1.0977 1.0978 1.0977 1.0991 1.0988 1.0990 1.0987 1.0995
irintensity: 0.0169 0.0261 3.0236 0.3794 0.2271 1.0935 0.1829 0.6650 1.5078 0.0717 2.1055 0.5964 1.1446 7.4806 4.1846 3.3079 13.6314 7.1562 23.5103 7.9242 3.5861 7.4425 9.6363 3.2717 8.3252 9.2297 13.2198 19.2814 27.0337 3.3470 61.4622 24.1777 171.0484 57.9604 50.7574 87.6680 159.3979 197.9654 89.0707 72.3631 7.9702 44.9409 58.0734 59.6614 36.1098 329.9824 60.8864 0.8597 64.4921 2.3882 1.6380 0.4369 15.2652 1.2495 9.6391 21.5291 14.3916 195.6419 140.5121 122.1877 10.9637 9.2991 15.4251 12.2135 6.6935 11.7531 0.3501 41.2504 8.9010 17.3242 6.8608 16.8031 1.3538 9.0239 14.6057
temp: 298.150 k
press: 1.00000 atm
elementType: 14 14 8 7 6 6 6 6 6 6 1 1 1 1 1 1 1 1 1 1 1 1 1 1 1 1 1
symmnumber: 1
zpe: 570380.1 jmol-1
zpe.correction: 0.217246 hartree
zpe.thermalcorrener: 0.233630 hartree
zpe.thermalcorrenthalpy: 0.234574 hartree
zpe.thermalcorrgfe: 0.173472 hartree
zpe.sumelectzpe: -946.826913 hartree
zpe.sumelectthermal: -946.810529 hartree
zpe.sumelectthermalent: -946.809585 hartree
zpe.sumelectthermalfe: -946.870688 hartree
dipole: -2.9122 -1.3093 -0.0013
dipole: 3.1930
quadrupole: -80.3831 -78.6795 -77.7851
quadrupole: -6.0820 -0.0051 -0.0007
quadrupole: -1.4339 0.2697 1.1641 -6.0820 -0.0051 -0.0007
hfenergy: -947.0441595 hartree
pointgroup: C01 [X(C6H17N1O1Si2)]
dipole: 1.22286 0.2875033 -0.0017631 debye
polarizability: 133.8036739|-0.2205007|121.3602631|-0.0303273|-0.01766|111.2445688 unknown
InChI: InChI=1S/C6H17NOSi2/c1-6(8)7(9(2)3)10(4)5/h9-10H,1-5H3
charge 0 multiplicity 1
27 atoms
Si 1.959468 -0.210224 -0.001248
Si -0.810385 1.361661 0.000283
O  -1.969831 -1.189913 0.002181
N  0.135093 -0.231117 -0.001364
C  2.596364 0.649001 1.576136
C  2.59628 0.653042 -1.576455
C  -1.813742 1.59943 -1.597944
C  -1.81557 1.594849 1.598036
C  -0.702712 -1.353572 -0.002555
C  -0.106907 -2.758041 -0.000403
H  2.420511 -1.645802 -0.00315
H  0.330868 2.365483 0.002332
H  2.186129 0.164856 2.479996
H  3.699361 0.592959 1.629133
H  2.307579 1.714851 1.593214
H  3.699235 0.59659 -1.629895
H  2.185569 0.171557 -2.481519
H  2.308015 1.719071 -1.590551
H  -1.172133 1.469272 -2.487455
H  -2.629477 0.859787 -1.640258
H  -2.247914 2.615778 -1.634478
H  -1.17507 1.46182 2.487917
H  -2.249445 2.611223 1.637078
H  -2.63165 0.855391 1.637205
H  0.525526 -2.930146 0.8886
H  0.522451 -2.933813 -0.890847
H  -0.936413 -3.480291 0.002509
