program: Gaussian 09
title: 000088855
version: EM64L-G09RevD.01
frameworkgroup: C1[X(C10H14O5)]
method: RPBEPBE
basis: SDD
operation: Freq
keyword: #pfreq=noraman
keyword: PBEPBE/SDD
title: #p freq=noraman PBEPBE/SDD
converged: YES YES NO NO
title: Mulliken charges:
elementType: O O O O O C C C C C C C C C C H H H H H H H H H H H H H H
charge: -0.247025 -0.270238 -0.249715 -0.191080 -0.250572 -0.277312 -0.259090 -0.577879 0.289065 0.222821 0.175907 0.338308 -0.753700 -0.753380 -0.627445 0.224461 0.252395 0.227952 0.250304 0.277600 0.239901 0.252891 0.234792 0.281623 0.236451 0.252236 0.215573 0.230732 0.254423
chargesum: 0.00000
title: Mulliken charges with hydrogens summed into heavy atoms:
elementType: O O O O O C C C C C C C C C C
charge: -0.247025 -0.270238 -0.249715 -0.191080 -0.250572 0.199544 0.219166 -0.060378 0.289065 0.222821 0.175907 0.338308 0.015606 -0.049120 -0.142290
polarizability: 1.55905366e+02 -6.21172898e+00 1.31419516e+02 1.51152330e+01 -1.06765559e+00 9.09477001e+01
1716.lowfreq: -10.0215 -8.4449 -3.2721 -0.0003 -0.0002 0.0006 2.4317 15.0232 21.4815
frequency: -8.6923 14.9637 21.4432 29.2086 51.6083 66.0688 108.8535 135.5279 143.6541 151.7942 178.6903 189.3871 210.0090 267.0103 283.2560 331.3376 364.9868 393.4412 399.8059 437.1049 475.3167 486.1101 512.2633 577.3803 589.3789 631.0215 708.0385 774.8273 783.0902 789.1124 807.8654 864.6673 881.4955 927.7693 949.2016 989.8125 990.6010 1010.2692 1013.2576 1029.2651 1034.8057 1053.9038 1094.4547 1109.9017 1117.2149 1180.6982 1203.9844 1222.3711 1243.4805 1280.8926 1288.8412 1352.8473 1373.2340 1379.5971 1398.0732 1416.0859 1432.1170 1446.6649 1453.6562 1455.4251 1456.8744 1457.6821 1473.1408 1610.6173 1622.7431 1650.6091 1653.1254 2980.5772 2990.3992 3011.5329 3018.7697 3023.3951 3064.2508 3074.1735 3079.3735 3095.1958 3099.5205 3104.6445 3126.8856 3129.0089 3216.6913
redmass: 5.3243 4.1303 6.8827 4.9154 4.8848 4.5682 4.7121 3.2664 1.2000 3.4329 1.0517 7.3205 3.1709 3.1235 3.0456 3.6617 2.7676 3.4705 2.2361 3.5683 4.1677 3.6016 3.4750 3.7879 3.8207 1.5325 5.0455 2.9860 2.3640 3.7022 3.5623 3.8639 1.8205 3.9858 1.9879 1.4695 2.1073 1.4434 2.0144 1.8887 2.3071 1.5037 2.3176 2.1825 3.8909 2.4484 1.1464 1.7946 1.1220 1.5921 3.1633 1.3712 1.2613 1.6838 1.1639 1.2501 1.0878 1.0594 1.0714 1.0773 1.0601 1.0640 1.0620 11.2571 9.6387 7.8333 5.2393 1.0380 1.0363 1.0578 1.0625 1.0607 1.0945 1.0972 1.1057 1.1049 1.1004 1.0622 1.0999 1.1007 1.1156
irintensity: 0.5623 0.4814 2.8642 4.6821 2.2441 3.2526 2.9165 4.9883 0.5902 3.1084 1.2201 0.4721 11.1088 10.2475 5.1856 3.4015 2.1121 0.7600 4.7244 16.6826 4.9034 7.8893 5.3914 8.4630 8.6668 9.9116 3.6082 4.3306 14.0203 7.2467 1.8599 8.9840 15.4469 28.8694 18.9207 32.9218 30.7922 7.6050 27.0101 2.4394 29.9679 6.7879 439.6297 21.9634 296.5430 286.0902 20.4035 48.1396 1.3575 147.1332 73.0348 2.6221 79.3640 3.6347 21.9764 10.0549 17.2252 32.5072 21.1321 10.8828 16.1671 28.0035 34.6272 157.7536 269.4456 68.7116 7.7723 5.3943 13.4955 3.6262 3.3472 33.4893 4.9135 12.9748 12.6549 20.2006 23.0365 3.3022 6.8462 3.2627 5.0600
temp: 298.150 k
press: 1.00000 atm
elementType: 8 8 8 8 8 6 6 6 6 6 6 6 6 6 6 1 1 1 1 1 1 1 1 1 1 1 1 1 1
symmnumber: 1
zpe: 592428.8 jmol-1
zpe.correction: 0.225644 hartree
zpe.thermalcorrener: 0.242047 hartree
zpe.thermalcorrenthalpy: 0.242991 hartree
zpe.thermalcorrgfe: 0.178138 hartree
zpe.sumelectzpe: -764.405130 hartree
zpe.sumelectthermal: -764.388727 hartree
zpe.sumelectthermalent: -764.387782 hartree
zpe.sumelectthermalfe: -764.452636 hartree
dipole: 1.5331 -1.2373 0.7378
dipole: 2.1037
quadrupole: -84.5818 -87.5746 -90.3799
quadrupole: -8.6394 -7.5806 4.2855
quadrupole: 2.9303 -0.0625 -2.8678 -8.6394 -7.5806 4.2855
hfenergy: -764.6307738 hartree
pointgroup: C01 [X(C10H14O5)]
dipole: 0.6541462 0.4917457 -0.123738 debye
polarizability: 159.1278445|6.2731344|129.5460008|-5.3866271|7.6466059|89.5987367 unknown
InChI: InChI=1S/C10H14O5/c1-7(2)10(13)15-5-4-14-9(12)6-8(3)11/h1,4-6H2,2-3H3
charge 0 multiplicity 1
29 atoms
O  0.84769 0.888137 0.975393
O  -1.791674 0.491375 -0.226293
O  2.776777 1.19007 -0.298454
O  2.498603 -2.786746 0.842731
O  -3.917632 0.906699 0.62785
C  0.141701 1.889732 0.125105
C  -1.34063 1.753469 0.407465
C  2.741344 -0.465747 1.544931
C  2.17159 0.617634 0.638843
C  3.156895 -1.723235 0.73569
C  -3.140861 0.159371 -0.016972
C  -3.475719 -1.157068 -0.651584
C  4.381053 -1.58437 -0.149262
C  -2.381918 -1.928731 -1.359854
C  -4.763744 -1.586294 -0.541558
H  0.502297 2.897679 0.401125
H  0.382636 1.701495 -0.934946
H  -1.900009 2.601547 -0.029866
H  -1.554288 1.717639 1.490026
H  1.996514 -0.7540 2.300297
H  3.641799 -0.051667 2.036239
H  4.486194 -2.464699 -0.801102
H  5.285939 -1.494529 0.483588
H  4.317673 -0.656842 -0.746776
H  -1.957507 -1.341195 -2.193758
H  -1.544201 -2.14934 -0.674419
H  -2.772408 -2.879578 -1.759878
H  -5.084199 -2.540303 -0.973491
H  -5.509318 -0.982902 -0.012267
