program: Gaussian 09
title: 000088960
version: EM64L-G09RevD.01
frameworkgroup: C1[X(C20H28N4O2)]
method: RPBEPBE
basis: SDD
operation: Freq
keyword: #p
keyword: freq=noraman
keyword: PBEPBE/SDD
title: #p freq=noraman PBEPBE/SDD
converged: NO YES NO NO
title: Mulliken charges:
elementType: O O N N N N C C C C C C C C C C C C C C C C C C C C H H H H H H H H H H H H H H H H H H H H H H H H H H H H
charge: -0.235575 -0.259350 -0.455435 -0.156739 -0.063148 -0.098324 0.294477 -0.443278 -0.444169 -0.414122 -0.415504 -0.389104 0.121966 -0.379072 0.190609 -0.386385 -0.378517 -0.357802 -0.354325 -0.480105 0.448690 -0.447018 -0.380274 -0.221386 -0.228592 -0.246392 0.218524 0.230354 0.229983 0.221580 0.194495 0.214071 0.214594 0.194533 0.203137 0.208518 0.320317 0.239923 0.240149 0.195992 0.241243 0.231298 0.194921 0.191361 0.224898 0.203205 0.183550 0.191891 0.219937 0.230949 0.266492 0.223242 0.223603 0.226114
chargesum: 0.00000
title: Mulliken charges with hydrogens summed into heavy atoms:
elementType: O O N N N N C C C C C C C C C C C C C C C C C C C C
charge: -0.235575 -0.259350 -0.135118 -0.156739 -0.063148 -0.098324 0.294477 0.005601 0.007394 -0.005556 -0.006377 0.022551 0.121966 0.101000 0.190609 0.050849 0.047702 0.058457 0.032430 -0.068277 0.448690 -0.216070 -0.113782 0.001856 -0.004988 -0.020278
polarizability: 3.01213039e+02 -9.97597093e+00 2.17410533e+02 2.96799371e+01 -7.29366426e-01 2.01704380e+02
1716.lowfreq: -11.5312 -6.0078 -3.0962 0.0005 0.0009 0.0010 6.7749 11.3082 16.1959
frequency: -4.4101 7.6240 16.0076 26.1955 40.6585 52.9124 63.2000 88.7661 91.9961 125.7576 163.0548 164.5692 177.2823 209.0912 217.3094 236.9335 253.8362 262.7887 272.5981 282.8036 303.9741 330.7873 362.6938 377.7580 391.5964 400.8657 405.7765 422.4179 448.5950 460.3356 480.7409 483.2686 491.2288 511.5536 582.6296 594.4898 604.8045 610.1444 618.9738 667.8290 686.7648 704.4641 706.5252 729.6727 738.7535 769.4479 778.1370 792.3187 808.5005 813.7703 844.3457 850.0001 856.6844 859.6328 904.5155 912.3886 916.0126 928.4688 944.4883 978.6534 982.0227 989.7030 993.3002 996.6559 1004.0170 1010.2494 1017.4793 1025.9679 1052.9921 1057.2530 1063.0973 1074.9145 1083.6516 1092.5991 1099.6113 1110.2314 1133.5659 1137.5788 1145.5644 1155.1978 1161.6182 1169.0759 1178.7845 1190.2058 1196.6222 1204.2491 1211.2467 1217.6627 1252.6133 1259.3264 1271.7223 1277.5977 1287.9228 1292.3556 1308.7383 1311.1509 1318.4401 1329.7891 1333.3214 1333.9909 1337.0890 1339.0391 1343.0201 1348.3565 1356.2117 1362.1210 1377.2981 1381.5754 1385.1326 1393.4757 1409.4167 1439.8199 1450.2528 1451.1974 1453.0020 1458.3676 1459.2217 1461.3636 1468.0128 1468.5072 1469.7748 1473.4701 1476.7220 1482.0689 1594.1745 1614.2894 1638.7620 1704.2504 2841.0858 2855.6723 2866.3627 2881.1083 2887.4718 2964.1918 2965.1021 2975.1866 2982.2371 2990.7487 2994.0058 3002.1441 3026.5338 3033.5168 3036.0855 3043.2273 3045.9216 3047.2440 3054.2318 3055.1294 3060.5487 3066.2752 3111.5533 3121.8747 3134.8672 3146.3182 3160.6453 3610.6316
redmass: 4.4836 4.1925 5.3301 4.2267 4.5934 5.4413 3.2857 3.4020 4.6155 5.2907 5.1923 5.6307 3.8892 4.2270 2.2388 2.9269 2.6819 2.4639 4.2315 2.4897 2.3984 4.3627 1.8200 2.0829 2.0751 2.8891 2.8505 4.0007 1.2639 2.7468 2.6913 3.1935 2.1669 3.4049 4.0542 4.3313 9.2135 2.6068 4.0055 3.5958 9.2209 2.2103 5.2229 6.0443 1.5845 3.9829 1.5091 3.1260 3.8902 3.2831 1.5565 1.5942 2.7203 1.2606 2.0387 2.5391 1.5457 1.3936 2.2091 2.1910 1.4169 5.4901 1.8605 1.5070 2.4030 1.9970 2.4866 2.0860 1.9449 1.7732 1.5032 1.6858 2.7038 2.3550 1.6312 3.7495 2.5814 1.6099 2.9764 2.6596 2.2306 1.0648 1.1142 1.4359 1.7724 1.4870 2.3268 1.6284 1.4371 1.6130 1.2098 1.5455 2.1257 1.4647 2.5673 1.3787 1.3701 1.4247 1.3698 1.3471 1.3718 1.4276 1.4934 1.5067 1.4355 1.7114 2.4290 1.5609 1.6277 2.1263 1.4580 2.0534 1.0989 1.1008 1.0838 1.0864 1.0893 1.1061 1.0842 1.1192 1.0814 1.1436 1.0925 2.0712 6.1734 6.1403 11.3744 9.7377 1.0706 1.0706 1.0693 1.0697 1.0690 1.0656 1.0661 1.0612 1.0861 1.0601 1.0611 1.0580 1.0897 1.0958 1.0933 1.1025 1.0907 1.0902 1.0908 1.1034 1.1033 1.1058 1.0867 1.0862 1.0916 1.0954 1.1014 1.0797
irintensity: 0.2524 0.0282 0.1070 0.2801 0.9756 0.3704 0.3852 0.1191 0.2256 0.0044 9.2165 4.3856 0.5225 0.6196 2.1169 0.8661 0.7944 0.8071 8.8839 6.7280 8.8026 15.8180 0.4005 2.7223 5.8313 2.0222 0.2412 15.6131 93.3451 4.6825 3.6530 21.8235 0.1625 2.1928 5.5492 2.1762 32.4256 1.5147 0.0414 3.5458 1.5536 33.3199 36.0189 12.9900 53.3563 23.3286 0.5034 24.6898 3.7743 3.1111 15.8243 0.2639 2.4292 0.1529 14.0070 7.1277 18.2401 8.9837 7.9127 13.3814 3.0813 0.8871 5.0522 6.0676 113.4833 35.0883 12.6185 10.5942 0.3504 5.3259 0.3790 11.0995 14.4910 12.5948 0.4125 6.4367 80.6156 3.2601 15.2559 7.1942 138.3048 0.1075 0.4369 1.6841 1.0493 2.0844 13.1487 18.4512 8.0910 4.8720 0.5008 2.5363 95.6247 32.3628 337.6599 30.4809 0.3623 3.3471 0.5471 29.7168 18.1675 25.7135 0.8270 7.0468 7.3799 6.0606 2.0147 2.6363 3.2595 2.0301 44.7851 14.0263 12.3376 14.4534 7.2721 12.7152 10.8023 1.8748 7.0755 34.1327 20.0982 2.1322 5.0112 11.5073 1.0162 7.6398 487.8010 269.1257 47.4686 65.7131 51.1720 31.7641 265.4281 28.9400 32.5232 35.2416 20.9313 14.5978 11.4277 38.3222 53.2068 59.2591 59.2431 38.3244 16.2979 33.4843 6.7964 10.6368 53.8738 5.3059 8.8541 0.2782 20.9446 32.3937 29.3164 35.8286
temp: 298.150 k
press: 1.00000 atm
elementType: 8 8 7 7 7 7 6 6 6 6 6 6 6 6 6 6 6 6 6 6 6 6 6 6 6 6 1 1 1 1 1 1 1 1 1 1 1 1 1 1 1 1 1 1 1 1 1 1 1 1 1 1 1 1
symmnumber: 1
zpe: 1200544.6 jmol-1
zpe.correction: 0.457263 hartree
zpe.thermalcorrener: 0.480368 hartree
zpe.thermalcorrenthalpy: 0.481312 hartree
zpe.thermalcorrgfe: 0.401684 hartree
zpe.sumelectzpe: -1146.444377 hartree
zpe.sumelectthermal: -1146.421272 hartree
zpe.sumelectthermalent: -1146.420328 hartree
zpe.sumelectthermalfe: -1146.499956 hartree
dipole: -2.6546 2.1509 -0.3215
dipole: 3.4317
quadrupole: -135.1369 -146.3205 -167.6059
quadrupole: -7.3862 -2.4038 1.3198
quadrupole: 14.5509 3.3672 -17.9181 -7.3862 -2.4038 1.3198
hfenergy: -1146.90164 hartree
pointgroup: C01 [X(C20H28N4O2)]
dipole: -1.026713 -0.6678053 0.5681116 debye
polarizability: 299.1151343|-6.5443011|212.8180894|-33.6956408|-6.9634506|208.3947291 unknown
InChI: InChI=1S/C20H28N4O2/c25-18-20(9-5-2-6-10-20)21-19(26)24(18)16-23-13-11-22(12-14-23)15-17-7-3-1-4-8-17/h1,3-4,7-8,21H,2,5-6,9-16H2
charge 0 multiplicity 1
54 atoms
O  -2.942388 1.842051 1.208127
O  -1.970738 -0.455729 -2.785866
N  -3.646433 -0.769285 -1.118444
N  -2.213933 0.948264 -0.863111
N  0.18881 1.266263 -0.473192
N  2.761844 0.540885 0.569326
C  -4.05647 -0.145738 0.161586
C  -5.507388 0.414088 0.114496
C  -3.88472 -1.110605 1.371406
C  -6.56454 -0.715003 0.116457
C  -4.943288 -2.237748 1.368363
C  -6.37949 -1.664392 1.323913
C  -3.028918 1.010048 0.267491
C  -1.012171 1.79783 -1.092197
C  -2.559863 -0.152018 -1.717591
C  1.205548 0.665722 -1.361282
C  0.766882 2.016237 0.659028
C  2.148055 -0.230989 -0.542135
C  1.715492 1.105046 1.457725
C  3.771715 -0.24227 1.318145
C  5.04062 -0.520666 0.516241
C  5.740235 -1.74095 0.681414
C  5.567336 0.456606 -0.365935
C  6.950334 -1.979559 -0.010594
C  6.77264 0.219497 -1.062601
C  7.471249 -0.998678 -0.885252
H  -5.621532 1.055434 -0.779404
H  -5.641594 1.058987 1.004407
H  -3.979958 -0.504311 2.292909
H  -2.862199 -1.531925 1.357707
H  -6.497431 -1.296444 -0.827036
H  -7.576027 -0.266884 0.131857
H  -4.8084 -2.867192 2.268193
H  -4.7826 -2.905313 0.495739
H  -6.575362 -1.103583 2.26051
H  -7.118727 -2.486606 1.279899
H  -4.089748 -1.585504 -1.533554
H  -1.267118 2.791721 -0.681423
H  -0.906587 1.868988 -2.190647
H  1.817227 1.44823 -1.873374
H  0.694703 0.061923 -2.132111
H  -0.0531 2.360421 1.314665
H  1.343804 2.908036 0.311678
H  1.565895 -1.103583 -0.150681
H  2.95318 -0.616844 -1.192332
H  2.206032 1.693666 2.255973
H  1.107922 0.29836 1.94161
H  3.356522 -1.213053 1.694463
H  4.039685 0.351131 2.216563
H  5.336129 -2.509197 1.353255
H  5.009089 1.390009 -0.499178
H  7.480495 -2.928977 0.127415
H  7.168738 0.982494 -1.742932
H  8.406844 -1.182489 -1.425687
