program: Gaussian 09
title: 000088830
version: EM64L-G09RevD.01
frameworkgroup: C1[X(C15H8F6O)]
method: RPBEPBE
basis: SDD
operation: Freq
keyword: #p
keyword: freq=noraman
keyword: PBEPBE/SDD
title: #p freq=noraman PBEPBE/SDD
converged: NO YES NO NO
title: Mulliken charges:
elementType: F F F F F F O C C C C C C C C C C C C C C C H H H H H H H H
charge: -0.158530 -0.158785 -0.155344 -0.158548 -0.155257 -0.158856 -0.180758 0.342301 0.333496 0.333512 -0.495240 -0.495241 -0.421031 -0.038332 0.298254 0.246226 0.246201 -0.323613 -0.339477 -0.234560 -0.225077 -0.219813 0.289864 0.289842 0.293102 0.247592 0.279213 0.238526 0.240377 0.239957
chargesum: 0.00000
title: Mulliken charges with hydrogens summed into heavy atoms:
elementType: F F F F F F O C C C C C C C C C C C C C C C
charge: -0.158530 -0.158785 -0.155344 -0.158548 -0.155257 -0.158856 -0.180758 0.342301 0.333496 0.333512 -0.205377 -0.205398 -0.127929 -0.038332 0.298254 0.246226 0.246201 -0.076021 -0.060264 0.003966 0.015300 0.020144
polarizability: 2.22015747e+02 -2.96747238e-04 1.31782867e+02 8.85135192e-01 1.20455264e-01 1.43361410e+02
1716.lowfreq: -30.4080 -21.2809 -20.7640 -5.8987 -4.1584 -0.0009 -0.0005 -0.0003 5.0012
frequency: -30.4055 -21.1538 -20.7302 37.4838 42.8678 90.3971 95.4679 105.0515 133.3050 149.0932 199.4049 224.9619 236.1957 277.5009 282.4018 293.7751 337.7488 340.2604 378.8319 390.9735 399.8109 434.8510 438.9512 441.4101 491.0543 503.6208 543.6839 606.6542 611.6253 613.8051 631.9554 644.6330 664.9527 688.8105 700.7481 709.0790 772.2854 783.3553 814.4512 862.9323 907.0112 918.9890 940.1248 950.2538 953.6608 986.9940 988.6038 995.6846 996.5464 999.6271 1014.0313 1022.1606 1022.6759 1026.3170 1066.4441 1085.7894 1098.5830 1161.7271 1176.9125 1187.2853 1228.3574 1252.6681 1293.6189 1317.0541 1354.8071 1380.8257 1390.7419 1435.4003 1439.5052 1445.1078 1477.1205 1551.5002 1589.0245 1609.1953 1611.9392 1612.9844 3132.9342 3140.5110 3150.3974 3160.9213 3161.6971 3164.9403 3166.9720 3171.6276
redmass: 8.7056 17.1507 18.9611 4.0181 7.4835 10.4461 11.1562 11.1960 6.9417 5.3725 5.3317 10.9745 6.9620 12.1699 5.6699 7.5234 11.1563 7.7492 9.6826 9.6004 2.8389 10.8861 8.0485 3.8982 12.6101 14.4324 8.5642 13.6890 6.4525 10.4239 8.2987 9.2396 6.4221 3.0137 2.2255 1.8629 7.2667 4.5234 3.4737 1.2471 1.8289 1.8098 1.4435 3.8420 1.4183 6.2391 6.2548 8.4444 1.3895 9.9081 1.3455 3.7725 3.2364 8.8632 5.5442 1.5928 2.6880 1.8462 1.0699 1.1385 2.4944 3.1486 1.2231 1.3524 9.2699 7.2486 8.9364 2.2860 4.0147 3.4883 2.2584 9.5687 6.5123 6.1635 5.7775 6.5576 1.0855 1.0883 1.0923 1.0965 1.0935 1.0922 1.0937 1.1016
irintensity: 1.1854 0.0705 0.0001 0.0061 1.0580 2.1834 1.9997 1.2199 0.7014 0.1697 2.7678 1.3023 1.7400 0.1917 0.0243 2.6407 0.0790 9.8675 17.1437 3.0420 0.0633 0.2731 0.9584 3.2092 0.8932 2.5116 0.1136 32.7679 0.6352 40.9465 0.0073 2.4646 13.4350 8.9064 22.1948 76.6402 51.9089 4.7846 64.6395 0.8866 100.6152 16.9335 0.0644 12.2138 2.6689 0.5926 0.9656 0.0824 0.8411 381.9381 0.0732 21.4019 90.9019 5.4032 283.1473 2.9911 150.5431 14.0780 1.1912 36.9358 467.0881 393.6621 0.2898 11.4143 24.9508 0.1642 4.3966 25.3694 2.9336 1.1759 1.0571 168.7729 20.5571 14.2822 11.2687 3.5359 0.5893 3.1147 11.9678 15.7246 1.3346 1.1570 0.0343 20.9281
temp: 298.150 k
press: 1.00000 atm
elementType: 9 9 9 9 9 9 8 6 6 6 6 6 6 6 6 6 6 6 6 6 6 6 1 1 1 1 1 1 1 1
symmnumber: 1
zpe: 506700.2 jmol-1
zpe.correction: 0.192992 hartree
zpe.thermalcorrener: 0.209488 hartree
zpe.thermalcorrenthalpy: 0.210432 hartree
zpe.thermalcorrgfe: 0.148030 hartree
zpe.sumelectzpe: -1249.131588 hartree
zpe.sumelectthermal: -1249.115092 hartree
zpe.sumelectthermalent: -1249.114148 hartree
zpe.sumelectthermalfe: -1249.176549 hartree
dipole: 4.9769 0.0026 2.4829
dipole: 5.5619
quadrupole: -111.1183 -137.9082 -128.8582
quadrupole: -0.0016 8.0037 -0.0060
quadrupole: 14.8433 -11.9467 -2.8966 -0.0016 8.0037 -0.0060
hfenergy: -1249.3245795 hartree
pointgroup: C01 [X(C15H8F6O1)]
dipole: 1.9674734 -0.0001894 -0.9577623 debye
polarizability: 222.0255078|-0.0355896|131.7825131|-0.1206573|0.1013084|143.3520037 unknown
InChI: InChI=1S/C15H8F6O/c16-14(17,18)11-6-10(7-12(8-11)15(19,20)21)13(22)9-4-2-1-3-5-9/h1-8H
charge 0 multiplicity 1
30 atoms
F  -1.665963 3.6445 0.055505
F  -2.892381 2.616709 -1.555792
F  -3.626171 2.626924 0.584516
F  -1.659773 -3.644702 0.049271
F  -3.62219 -2.630969 0.578008
F  -2.886355 -2.616647 -1.561565
O  1.854086 0.002537 2.550177
C  0.286399 0.000967 0.726866
C  -1.723762 1.214113 0.045093
C  -1.721669 -1.214393 0.042831
C  -0.385488 -1.221815 0.498444
C  -0.387592 1.223007 0.500705
C  -2.403032 -0.00051 -0.188731
C  1.700169 0.001675 1.292783
C  2.852792 0.000887 0.343985
C  -2.456548 2.50562 -0.208614
C  -2.452076 -2.5067 -0.213634
C  2.664586 -0.000003 -1.066059
C  4.173203 0.001066 0.876093
C  3.78081 -0.000678 -1.928883
C  5.284071 0.000375 0.012392
C  5.090058 -0.000498 -1.392089
H  0.123158 -2.173792 0.678598
H  0.119491 2.175519 0.682421
H  -3.438887 -0.00106 -0.543442
H  1.651854 -0.000128 -1.483881
H  4.295643 0.001757 1.964468
H  3.633433 -0.00134 -3.014033
H  6.298686 0.000509 0.42482
H  5.95585 -0.001028 -2.063752
