program: Gaussian 09
title: 000088859
version: EM64L-G09RevD.01
frameworkgroup: C1[X(C21H29N3O)]
method: RPBEPBE
basis: SDD
operation: Freq
keyword: #p
keyword: freq=noraman
keyword: PBEPBE/SDD
title: #p freq=noraman PBEPBE/SDD
converged: YES YES NO NO
title: Mulliken charges:
elementType: O N N N C C C C C C C C C C C C C C C C C C C C C H H H H H H H H H H H H H H H H H H H H H H H H H H H H H
charge: -0.246679 -0.146041 -0.155319 -0.154915 -0.342876 -0.346420 -0.339329 0.477186 0.508610 -0.332722 -0.330880 -0.477577 -0.500615 -0.377907 -0.364198 -0.362758 -0.362553 -0.384889 -0.373695 0.400093 0.400832 -0.647384 -0.647180 -0.647223 -0.647092 0.192122 0.238186 0.191733 0.187453 0.238540 0.209711 0.188461 0.188391 0.209034 0.221013 0.222084 0.251199 0.234393 0.230465 0.231576 0.230954 0.231756 0.230192 0.213430 0.231461 0.230171 0.231796 0.213742 0.230784 0.231503 0.213993 0.232209 0.231139 0.214040
chargesum: 0.00000
title: Mulliken charges with hydrogens summed into heavy atoms:
elementType: O N N N C C C C C C C C C C C C C C C C C C C C C
charge: -0.246679 -0.146041 -0.155319 -0.154915 -0.150754 0.083499 0.086664 0.477186 0.508610 0.065450 0.066546 -0.256565 -0.278531 -0.126708 -0.129805 -0.132294 -0.130977 -0.153934 -0.141939 0.400093 0.400832 0.027698 0.028529 0.029057 0.030296
polarizability: 3.36279931e+02 -9.79989035e-01 2.43274501e+02 -7.04847992e+00 -1.14721678e+00 2.19709097e+02
1716.lowfreq: -12.7505 -9.6509 -0.0004 0.0003 0.0005 5.7735 20.1063 22.6740 38.0746
frequency: 18.7894 22.5336 37.7401 38.9488 53.5133 56.8464 76.9462 79.6179 83.6357 85.7276 114.9995 122.5360 147.8923 166.0664 198.0076 202.4376 204.2516 213.3964 228.9078 237.7598 257.1618 278.1511 305.8993 315.5579 338.0190 364.2795 406.0395 412.3117 417.3133 421.2953 424.2990 462.3695 463.8576 474.2645 488.0358 516.5692 542.0518 551.0194 571.6299 612.6948 633.6162 640.7409 710.1831 715.6614 733.2581 751.0211 789.7587 802.3066 803.3003 806.3246 812.6267 819.8528 840.8362 842.2274 847.7191 915.8819 934.8303 940.0342 944.7275 945.5875 948.8944 978.6816 990.3610 998.7041 1000.7504 1026.3752 1051.8768 1056.4624 1056.9993 1081.9693 1089.8496 1105.2944 1108.9675 1109.7276 1111.4014 1111.9970 1121.3597 1132.7312 1150.7579 1163.5164 1164.4955 1181.9211 1186.1584 1190.2792 1213.0805 1217.5563 1239.5450 1262.6936 1264.9442 1265.9501 1276.3125 1289.6561 1290.4743 1328.1276 1330.0484 1334.5526 1345.0095 1355.1004 1357.2372 1368.6891 1371.6186 1384.1258 1389.1101 1423.0629 1424.0801 1436.1866 1436.9399 1442.3377 1449.4139 1451.4172 1458.1625 1459.1969 1462.2056 1462.3008 1463.9358 1472.6487 1473.1263 1494.3437 1495.1049 1506.8236 1507.3136 1522.0887 1527.2321 1566.7678 1568.7043 1630.6348 1633.5654 2818.4100 2856.9950 2866.9741 2929.4020 2930.3814 2938.4561 2939.4263 2946.8179 2951.3546 2991.7453 2993.1566 2994.2651 2996.0693 3052.7609 3060.8677 3074.6851 3077.8865 3089.1127 3091.6616 3099.3802 3101.0680 3107.5569 3109.3507 3125.6863 3134.6888 3156.4247 3158.2833 3160.7472 3162.7919
redmass: 3.3097 3.9527 4.0214 3.4071 4.4060 2.8264 2.5707 2.4817 2.3484 2.7515 2.0656 1.8655 3.6786 3.7764 3.4088 1.1975 1.1695 1.9677 2.3127 2.2366 3.2479 2.8474 2.8172 3.4579 4.3338 4.4368 2.1479 2.8537 3.1763 3.0084 3.3475 2.8789 3.7460 3.5266 3.9439 2.5827 2.6073 3.2111 3.2090 2.6156 7.1370 4.0565 3.6551 3.9237 3.9169 4.3616 3.7047 1.4608 1.8005 2.1754 1.5387 3.1951 2.2194 1.7754 3.8395 2.3068 1.4509 1.4223 2.9832 2.9494 1.3787 1.3596 3.0142 2.8845 2.8399 2.1542 2.0828 1.4821 1.4855 3.6646 2.8060 2.2249 1.3050 1.3153 1.2496 1.2396 1.4855 1.4672 3.8008 1.8120 1.7458 1.5075 1.1543 1.1902 1.4711 1.5815 1.3492 1.2770 2.9187 2.8666 1.7855 1.2339 1.3643 1.3995 1.2756 1.4252 1.3212 3.3011 3.2782 1.2803 2.1075 3.5873 2.6260 1.9944 1.8693 1.4602 1.5535 1.0831 1.0971 1.0837 1.2138 1.2112 1.0438 1.0416 1.1040 1.0465 1.0465 1.0826 1.0828 1.1370 1.1269 2.3938 2.5086 6.4997 6.7649 6.2285 6.3108 1.0809 1.0713 1.0697 1.0369 1.0371 1.0397 1.0398 1.0668 1.0669 1.0987 1.0991 1.1029 1.1027 1.0882 1.0885 1.0953 1.0970 1.0956 1.0953 1.0935 1.0934 1.0890 1.0891 1.0879 1.0871 1.0928 1.0929 1.0934 1.0943
irintensity: 0.1000 0.7877 0.3126 0.2722 0.0236 0.5882 1.7974 2.7511 2.6820 4.4686 0.1930 0.3541 4.8819 0.1062 0.0349 0.0493 0.1304 0.1343 1.6652 2.9121 1.1979 1.3032 8.3282 1.2958 1.8977 0.7893 0.4611 0.5635 0.3833 0.8536 1.4784 1.3321 7.3789 0.6691 1.2886 5.0063 33.2361 17.2384 13.5592 2.1021 0.1301 3.0635 2.8305 2.5458 0.4879 11.1831 26.8296 13.2589 11.0163 20.6185 16.9879 52.4388 33.4235 11.9954 6.3790 20.8946 4.6150 3.2585 17.9709 22.2196 0.5934 8.0965 30.2941 0.6062 7.5072 11.1646 25.5347 18.5101 35.1835 43.8644 48.7338 12.0676 0.9811 1.0767 0.1995 0.0131 3.4177 10.6086 6.6362 13.8810 16.0168 31.5205 12.8648 38.4038 0.8759 4.5721 12.3954 4.9385 22.6904 44.7140 32.8118 27.0696 9.9143 17.1033 5.0224 6.0964 8.0793 173.5474 93.9736 2.0807 4.8972 5.3308 14.0699 2.8531 6.4227 0.8813 1.2324 2.0233 15.6532 1.1297 21.0173 11.6483 0.6128 0.1484 3.2999 19.4527 19.7274 1.9056 2.1853 24.2918 14.0294 435.6254 165.0914 1.1935 9.0047 242.9708 112.0501 41.1508 42.5544 139.6564 110.6041 132.5264 128.2430 74.9728 34.0771 103.7617 0.0632 6.3500 97.2756 92.8089 25.5226 18.3468 45.6326 45.3884 4.4062 4.4221 58.0302 55.3697 9.0553 20.6448 10.4364 10.4061 21.8238 34.1176 16.6370 8.8768
temp: 298.150 k
press: 1.00000 atm
elementType: 8 7 7 7 6 6 6 6 6 6 6 6 6 6 6 6 6 6 6 6 6 6 6 6 6 1 1 1 1 1 1 1 1 1 1 1 1 1 1 1 1 1 1 1 1 1 1 1 1 1 1 1 1 1
symmnumber: 1
zpe: 1207817.0 jmol-1
zpe.correction: 0.460033 hartree
zpe.thermalcorrener: 0.485417 hartree
zpe.thermalcorrenthalpy: 0.486361 hartree
zpe.thermalcorrgfe: 0.402515 hartree
zpe.sumelectzpe: -1055.178983 hartree
zpe.sumelectthermal: -1055.153599 hartree
zpe.sumelectthermalent: -1055.152655 hartree
zpe.sumelectthermalfe: -1055.236501 hartree
dipole: 0.1138 -4.9111 0.5714
dipole: 4.9455
quadrupole: -110.9034 -160.9520 -139.7726
quadrupole: -1.2759 -1.2415 -1.6379
quadrupole: 26.3059 -23.7427 -2.5632 -1.2759 -1.2415 -1.6379
hfenergy: -1055.6390161 hartree
pointgroup: C01 [X(C21H29N3O1)]
dipole: -0.033883 -1.9353021 -0.1982731 debye
polarizability: 336.5126197|1.1919221|243.3095422|-4.6754993|0.8139753|219.4413667 unknown
InChI: InChI=1S/C21H29N3O/c1-22(2)19-9-5-17(6-10-19)21(24-13-15-25-16-14-24)18-7-11-20(12-8-18)23(3)4/h5-12,21H,13-16H2,1-4H3
charge 0 multiplicity 1
54 atoms
O  -0.107276 5.153783 -0.405374
N  -0.00887 2.264704 0.023473
N  4.762647 -2.201846 -0.167637
N  -4.698347 -2.276848 -0.431456
C  -0.02436 0.974648 0.791353
C  1.102737 3.156495 0.455671
C  -1.288852 3.019696 0.102004
C  1.265875 0.180927 0.538482
C  -1.263761 0.135548 0.455481
C  1.158956 4.402173 -0.441103
C  -1.213674 4.262829 -0.797173
C  1.841406 -0.601992 1.566533
C  -2.170909 -0.252851 1.4686
C  1.891656 0.151714 -0.732397
C  -1.534081 -0.303457 -0.865412
C  2.987861 -1.390894 1.347984
C  -3.301803 -1.047983 1.192933
C  3.040633 -0.623925 -0.972783
C  -2.660844 -1.088571 -1.166424
C  3.618854 -1.423905 0.06427
C  -3.577142 -1.487488 -0.139531
C  5.33627 -3.003584 0.917275
C  5.381994 -2.215292 -1.496285
C  -5.609233 -2.680231 0.644198
C  -4.945671 -2.720787 -1.806989
H  -0.072589 1.190501 1.892065
H  2.058314 2.608459 0.385566
H  0.967506 3.476276 1.520413
H  -1.509008 3.340171 1.15225
H  -2.116404 2.372251 -0.23459
H  1.930057 5.109118 -0.091576
H  1.381622 4.094863 -1.486531
H  -1.079266 3.94411 -1.85408
H  -2.12746 4.873814 -0.707035
H  1.380777 -0.603159 2.563339
H  -1.993806 0.074694 2.501459
H  1.47613 0.773261 -1.534406
H  -0.850084 -0.020475 -1.673229
H  3.392292 -1.977202 2.178179
H  -3.969138 -1.321608 2.015203
H  3.490554 -0.604824 -1.969884
H  -2.824339 -1.400771 -2.202026
H  5.653146 -2.374262 1.775102
H  6.224613 -3.540125 0.547273
H  4.618306 -3.758807 1.300002
H  5.727658 -1.20599 -1.803224
H  4.682575 -2.583611 -2.275525
H  6.258454 -2.882863 -1.48638
H  -6.068519 -1.804275 1.147773
H  -5.093872 -3.284036 1.420243
H  -6.423359 -3.292948 0.225227
H  -4.114423 -3.343795 -2.198044
H  -5.080868 -1.864462 -2.499806
H  -5.865242 -3.326866 -1.837155
