program: Gaussian 09
title: 000088800
version: EM64L-G09RevD.01
frameworkgroup: C1[X(C11H16N2O3)]
method: RPBEPBE
basis: SDD
operation: Freq
keyword: #p
keyword: freq=noraman
keyword: PBEPBE/SDD
title: #p freq=noraman PBEPBE/SDD
converged: YES YES NO NO
title: Mulliken charges:
elementType: O O O N N C C C C C C C C C C C H H H H H H H H H H H H H H H H
charge: -0.212029 -0.215122 -0.222023 -0.371181 -0.375756 0.109992 -0.397191 -0.528780 0.144838 0.156914 -0.717284 -0.290969 0.152444 0.369017 -0.783083 -0.792695 0.222926 0.249634 0.224509 0.255969 0.228960 0.229088 0.224128 0.253297 0.365741 0.363547 0.218414 0.219673 0.235880 0.230965 0.225655 0.224522
chargesum: 0.00000
title: Mulliken charges with hydrogens summed into heavy atoms:
elementType: O O O N N C C C C C C C C C C C
charge: -0.212029 -0.215122 -0.222023 -0.005440 -0.012208 0.109992 0.075369 -0.048302 0.144838 0.156914 -0.035107 -0.037672 0.152444 0.369017 -0.109115 -0.111554
polarizability: 1.94045196e+02 9.83752330e+00 1.30856194e+02 1.22880302e+01 -6.53751761e+00 1.11420788e+02
1716.lowfreq: -11.1840 -9.1385 0.0006 0.0008 0.0008 6.6642 22.3858 27.0632 51.3842
frequency: 22.0482 26.7419 51.2960 83.2548 99.7066 115.9881 135.3620 151.5328 156.2761 172.1159 184.5588 191.6132 210.2955 295.7576 300.3382 324.8779 357.5608 367.5419 390.1189 434.2388 441.8368 479.4847 497.9478 509.9390 590.0345 628.8973 660.9517 682.7227 710.6784 719.4721 755.7175 769.2024 773.9153 789.9076 850.1572 885.4044 922.7571 947.9614 956.5447 979.6740 992.4198 993.2145 1032.4781 1082.6996 1084.9436 1108.5694 1127.3549 1142.2003 1182.1461 1218.0620 1250.8844 1281.0540 1299.6447 1311.8162 1337.6063 1366.4074 1372.6694 1374.7201 1376.5550 1392.0715 1393.7759 1402.0324 1450.2761 1454.3715 1456.8810 1470.0163 1472.8767 1477.7398 1480.6261 1483.6380 1612.7031 1647.6757 1676.2768 1687.5119 2963.0846 2968.5486 2970.1168 2983.3334 3018.6745 3034.4363 3038.3060 3061.8755 3067.7099 3081.4267 3087.8647 3093.4045 3094.5559 3110.5685 3519.1672 3520.9496
redmass: 4.6629 3.7788 3.7029 2.9985 2.4774 1.0641 5.9289 7.8153 2.4446 2.0968 1.9239 2.4145 1.7138 2.8419 2.1561 2.3571 11.2099 8.4245 2.4035 4.4466 2.6710 7.2953 4.1090 2.7147 8.5545 3.9013 2.4160 2.3901 5.6193 3.9396 1.5513 1.5901 2.4107 1.7721 1.5324 2.0038 3.6876 1.4155 2.2213 2.2781 1.2541 3.2123 1.8222 1.6851 2.8668 1.7990 2.6418 2.3169 2.9230 2.6806 1.5797 1.2652 3.2884 1.4822 1.4816 7.7924 1.5747 1.7147 1.4938 1.3279 1.2132 1.2273 1.0830 1.0604 1.0687 1.0692 1.0444 1.0903 1.0510 1.0418 6.8506 8.5663 5.4361 6.2054 1.0376 1.0504 1.0533 1.0359 1.0607 1.0967 1.0962 1.0946 1.1001 1.0983 1.0983 1.1021 1.0965 1.0899 1.0758 1.0781
irintensity: 0.5158 0.6094 0.4756 0.0655 0.0574 0.1729 0.3600 13.4690 0.4040 1.9673 0.3369 0.5613 0.5031 4.8181 2.4166 1.7766 25.3549 9.8728 1.1453 9.7446 12.6853 16.3315 11.7125 2.1820 1.9936 5.0142 2.7141 37.3123 16.9870 2.4091 0.4576 5.9315 30.1588 180.0591 20.6515 4.3451 29.4910 0.3818 7.6916 15.2240 5.4550 3.3093 14.3856 4.2660 16.2499 23.5583 1.2045 2.1111 34.6990 11.2173 14.7956 8.9804 330.8770 45.2817 50.0989 211.7375 4.3238 15.1569 7.1088 23.8687 16.3258 12.3858 23.2807 4.1523 0.2411 16.4078 31.7326 13.9257 5.4107 18.4073 302.2487 60.8800 671.3083 10.0995 32.8119 44.4514 25.0533 25.1857 13.2573 8.3820 37.8646 4.6678 5.6012 32.9317 20.9787 15.1921 34.7130 17.3440 83.7119 45.3066
temp: 298.150 k
press: 1.00000 atm
elementType: 8 8 8 7 7 6 6 6 6 6 6 6 6 6 6 6 1 1 1 1 1 1 1 1 1 1 1 1 1 1 1 1
symmnumber: 1
zpe: 680270.6 jmol-1
zpe.correction: 0.259101 hartree
zpe.thermalcorrener: 0.276336 hartree
zpe.thermalcorrenthalpy: 0.277280 hartree
zpe.thermalcorrgfe: 0.212910 hartree
zpe.sumelectzpe: -762.764227 hartree
zpe.sumelectthermal: -762.746992 hartree
zpe.sumelectthermalent: -762.746048 hartree
zpe.sumelectthermalfe: -762.810418 hartree
dipole: 2.3165 0.1144 -0.3513
dipole: 2.3458
quadrupole: -96.5099 -102.5913 -97.9601
quadrupole: -1.5084 -4.5800 2.5522
quadrupole: 2.5105 -3.5709 1.0603 -1.5084 -4.5800 2.5522
hfenergy: -763.0233283 hartree
pointgroup: C01 [X(C11H16N2O3)]
dipole: -0.9055202 -0.0249087 -0.1764889 debye
polarizability: 194.6518223|11.4647306|128.4001365|-7.6841181|9.6295394|113.2702194 unknown
InChI: InChI=1S/C11H16N2O3/c1-4-11(6-5-7(2)3)8(14)12-10(16)13-9(11)15/h5,12-13H,4,6H2,1-3H3
charge 0 multiplicity 1
32 atoms
O  1.089401 -2.277842 -1.100351
O  0.127856 1.442986 1.846672
O  4.013075 1.310909 -0.691604
N  2.49434 -0.455548 -0.899977
N  1.997951 1.382802 0.494332
C  0.220754 -0.361738 0.172289
C  -0.50574 -1.32553 1.151665
C  -0.806735 0.176588 -0.937778
C  1.285468 -1.127342 -0.629899
C  0.758565 0.861538 0.926237
C  0.413799 -1.940378 2.226628
C  -2.047588 0.827999 -0.375046
C  2.911057 0.787957 -0.392796
C  -3.338707 0.41677 -0.54863
C  -4.483482 1.21587 0.054186
C  -3.771651 -0.8127 -1.327116
H  -0.964025 -2.127514 0.544906
H  -1.319281 -0.753024 1.629165
H  -0.262289 0.895701 -1.584367
H  -1.056796 -0.69797 -1.562572
H  1.21911 -2.54859 1.775706
H  0.869835 -1.160049 2.862843
H  -0.169796 -2.604861 2.888281
H  -1.876699 1.733408 0.223107
H  3.166834 -0.934907 -1.507686
H  2.31054 2.255256 0.933188
H  -5.178289 1.568739 -0.733706
H  -5.082305 0.588881 0.744405
H  -4.121821 2.094633 0.614363
H  -2.932608 -1.404019 -1.727665
H  -4.419334 -0.52429 -2.178565
H  -4.37834 -1.479533 -0.683416
