program: Gaussian 09
title: 000088789
version: EM64L-G09RevD.01
frameworkgroup: C1[X(C8H14N4OS)]
method: RPBEPBE
basis: SDD
operation: Freq
keyword: #p
keyword: freq=noraman
keyword: PBEPBE/SDD
title: #p freq=noraman PBEPBE/SDD
converged: YES YES NO NO
title: Mulliken charges:
elementType: S O N N N N C C C C C C C C H H H H H H H H H H H H H H
charge: 0.313427 -0.232530 -0.167600 -0.050200 -0.062857 -0.495458 -0.064281 -0.449351 -0.001230 -0.694765 -0.704832 0.149435 -0.166350 -0.814375 0.242637 0.216704 0.225747 0.210652 0.209533 0.224598 0.219080 0.216772 0.207459 0.325241 0.325084 0.288916 0.240620 0.287925
chargesum: 0.00000
title: Mulliken charges with hydrogens summed into heavy atoms:
elementType: S O N N N N C C C C C C C C
charge: 0.313427 -0.232530 -0.167600 -0.050200 -0.062857 0.154866 0.178356 -0.006900 -0.001230 -0.049982 -0.061520 0.149435 -0.166350 0.003085
polarizability: 2.09986684e+02 1.53716675e+01 1.36354514e+02 -9.94791756e+00 5.03369749e+00 8.77207730e+01
1716.lowfreq: -55.7257 -6.4269 -0.0018 -0.0018 0.0017 5.9335 10.2432 38.3104 47.4295
frequency: -55.4111 38.1509 47.3892 63.8477 82.1123 116.3286 130.7718 142.8470 164.6223 203.5528 227.6730 242.5439 254.9317 284.4630 290.6855 324.3109 330.6080 385.1773 414.4104 422.9619 472.4131 511.6817 572.9985 616.5509 626.9918 644.6997 691.7177 756.2852 783.9377 821.9837 871.2105 909.4536 919.5782 936.7109 957.5903 962.6876 980.2529 997.3505 1035.2405 1101.8270 1126.7135 1171.7241 1178.2577 1214.9066 1272.1147 1279.1436 1294.2575 1296.2920 1326.0193 1339.9547 1344.8067 1379.2610 1382.4977 1397.1976 1431.0830 1435.1973 1446.3575 1450.8423 1466.4395 1470.6389 1481.8244 1486.1235 1602.6864 1666.4427 2969.5727 2973.6793 2991.0732 2995.7729 3027.5651 3062.4670 3064.3929 3071.9569 3074.2998 3075.7184 3153.9335 3165.5648 3397.5600 3518.4449
redmass: 1.1693 2.7918 4.2399 3.6675 4.1581 1.2835 2.8749 4.0801 3.5317 1.0875 1.2244 4.9101 4.3280 2.7113 2.6061 4.4933 3.6757 3.4217 2.1839 5.7160 6.2318 8.3903 4.8434 10.1615 11.0290 7.4176 5.1550 4.3298 2.2153 3.0970 1.7277 5.9342 1.2848 2.1910 1.6302 2.3540 1.1825 1.4120 5.6183 1.7984 2.3653 1.8639 6.8356 1.6608 1.1850 1.6201 3.6952 2.6551 1.3444 1.5119 1.2561 1.2458 5.5064 1.2137 1.0517 1.4893 1.1724 2.1879 1.0530 1.0576 1.0557 1.0509 10.5526 1.1028 1.0354 1.0360 1.0663 1.0771 1.0283 1.0997 1.1013 1.0999 1.0990 1.0989 1.1042 1.1057 1.0431 1.0991
irintensity: 57.2539 0.6416 3.6447 0.3051 6.0399 0.7456 0.0238 3.4486 2.1666 0.3847 0.2498 0.2578 5.5839 3.4130 2.6702 22.3562 2.2427 4.8567 0.9267 2.3053 6.1840 8.4666 11.7082 9.5369 1.7772 1.9534 2.8362 11.8464 80.9155 3.5251 7.9886 7.5320 5.7596 4.3450 6.5949 15.1881 7.1247 16.3161 1.3544 34.4390 9.0773 43.1744 38.8853 4.8018 0.9933 35.8567 261.9867 5.5485 6.4378 6.8762 7.5409 9.8017 200.2074 13.7397 14.8501 5.7252 22.8669 43.7797 0.2733 9.2112 5.8642 19.0887 227.4239 66.4137 40.7712 27.8256 10.0913 12.8468 20.7411 9.0019 6.4569 22.7814 74.1927 65.0689 7.2475 7.5739 13.3371 13.6202
temp: 298.150 k
press: 1.00000 atm
elementType: 16 8 7 7 7 7 6 6 6 6 6 6 6 6 1 1 1 1 1 1 1 1 1 1 1 1 1 1
symmnumber: 1
zpe: 579120.2 jmol-1
zpe.correction: 0.220575 hartree
zpe.thermalcorrener: 0.236033 hartree
zpe.thermalcorrenthalpy: 0.236977 hartree
zpe.thermalcorrgfe: 0.177272 hartree
zpe.sumelectzpe: -1004.398854 hartree
zpe.sumelectthermal: -1004.383396 hartree
zpe.sumelectthermalent: -1004.382451 hartree
zpe.sumelectthermalfe: -1004.442156 hartree
dipole: -1.2729 1.1642 0.6987
dipole: 1.8611
quadrupole: -84.8041 -93.3370 -89.8664
quadrupole: -0.7884 0.2802 -1.0521
quadrupole: 4.5317 -4.0012 -0.5306 -0.7884 0.2802 -1.0521
hfenergy: -1004.6194288 hartree
pointgroup: C01 [X(C8H14N4O1S1)]
dipole: -0.497666 -0.4203982 -0.3342682 debye
polarizability: 207.4532546|-18.9330965|136.57721|15.6621211|7.0598117|90.0315058 unknown
InChI: InChI=1S/C8H14N4OS/c1-5(2)4-6-7(13)12(9)8(14-3)11-10-6/h5H,4,9H2,1-3H3
charge 0 multiplicity 1
28 atoms
S  -3.706212 0.156069 -0.734922
O  0.74687 -2.214074 -0.211066
N  -1.259122 -1.017067 -0.409334
N  -0.021142 1.289075 0.547146
N  -1.386633 1.306475 0.18977
N  -1.960803 -2.159533 -0.893125
C  3.132169 0.136398 -0.421283
C  2.156525 0.190798 0.800439
C  0.699849 0.161328 0.415891
C  2.99615 1.394676 -1.30839
C  4.582628 -0.028355 0.087601
C  0.135895 -1.114401 -0.078537
C  -1.955525 0.182989 -0.268133
C  -4.114179 1.961335 -0.355639
H  2.870825 -0.759232 -1.018905
H  2.371809 -0.679241 1.450688
H  2.341735 1.116812 1.374549
H  3.66109 1.323921 -2.189173
H  3.275477 2.30397 -0.742508
H  1.962076 1.535862 -1.671605
H  4.699976 -0.956632 0.676985
H  5.293472 -0.069996 -0.758241
H  4.873154 0.825141 0.730341
H  -1.528515 -2.488744 -1.768675
H  -1.950511 -2.902929 -0.179521
H  -3.926057 2.168741 0.706083
H  -5.182319 2.066283 -0.602309
H  -3.493383 2.620731 -0.976627
