program: Gaussian 09
title: 000008025
version: EM64L-G09RevD.01
frameworkgroup: C1[X(C3H6O2)]
method: RPBEPBE
basis: SDD
operation: Freq
keyword: #p
keyword: freq=noraman
keyword: PBEPBE/SDD
title: #p freq=noraman PBEPBE/SDD
converged: NO NO NO NO
title: Mulliken charges:
elementType: O O C C C H H H H H H
charge: -0.229973 -0.234968 -0.243576 -0.665910 0.017951 0.234718 0.234716 0.212818 0.232074 0.232073 0.210075
chargesum: 0.00000
title: Mulliken charges with hydrogens summed into heavy atoms:
elementType: O O C C C
charge: -0.229973 -0.234968 0.225858 0.011056 0.228026
polarizability: 5.07892391e+01 -2.74185151e-01 3.78624500e+01 1.22124315e-05 7.64835650e-05 2.79063785e+01
1716.lowfreq: 0.0003 0.0003 0.0008 7.4336 14.3770 33.3270 52.7364 204.5078 230.2528
frequency: 52.7301 204.5047 230.2462 342.8867 356.4861 730.6979 786.0004 800.8328 955.9961 1015.5015 1099.3498 1113.6409 1137.5570 1252.3161 1334.7204 1357.2457 1401.5031 1464.2056 1475.4108 1486.7763 1616.2698 2995.0303 3007.9232 3039.8211 3066.0536 3091.0097 3109.5835
redmass: 2.6334 4.6620 1.1097 2.3254 3.2275 7.3762 3.4094 1.0975 1.6131 2.0712 10.0620 2.2110 1.4670 1.1324 1.1758 1.2717 1.2560 1.0402 1.0580 1.0716 8.3093 1.0360 1.0584 1.0917 1.1069 1.0982 1.1025
irintensity: 0.6004 7.7215 2.5158 29.0817 6.6023 1.7148 7.4562 4.4244 3.1096 17.1230 312.8045 3.9605 7.4445 0.0367 14.1652 2.5533 24.2537 12.1657 4.6934 17.1433 262.4013 19.0224 16.6667 55.4768 10.9181 27.8591 43.1584
temp: 298.150 k
press: 1.00000 atm
elementType: 8 8 6 6 6 1 1 1 1 1 1
symmnumber: 1
zpe: 230426.5 jmol-1
zpe.correction: 0.087765 hartree
zpe.thermalcorrener: 0.093687 hartree
zpe.thermalcorrenthalpy: 0.094632 hartree
zpe.thermalcorrgfe: 0.058279 hartree
zpe.sumelectzpe: -267.945191 hartree
zpe.sumelectthermal: -267.939268 hartree
zpe.sumelectthermalent: -267.938324 hartree
zpe.sumelectthermalfe: -267.974676 hartree
dipole: -2.1859 0.6549 0.0000
dipole: 2.2819
quadrupole: -31.7599 -30.7987 -29.3529
quadrupole: 5.9710 0.0001 0.0000
quadrupole: -1.1228 -0.1615 1.2843 5.9710 0.0001 0.0000
hfenergy: -268.0329553 hartree
pointgroup: C01 [X(C3H6O2)]
dipole: 0.8658563 0.2373045 -0.0000049 debye
dipolederiv: -1.5615754 0.027077 0.0000008 0.1263569 -0.5018183 0.0000015 -0.0000021 0.000001 -0.289146 -0.8173504 -0.0570899 0.0000002 -0.5487828 -0.677834 0.0000037 0.0000052 0.0000041 -0.3263233 0.6809865 -0.1689852 0.0000014 -0.3171376 0.3555567 0.0000019 0.0000004 0.000002 0.362866 -0.1328375 -0.0133552 0.0000032 -0.0145714 0.0456903 0.0000025 0.0000041 0.0000018 0.0599393 1.7530227 0.1297248 0.0000005 0.5310551 0.9176185 -0.0000089 -0.0000008 -0.0000081 0.1710855 -0.0170441 -0.0223377 0.0645446 0.0582094 -0.0098511 0.072614 0.0352148 0.1006756 -0.0596126 -0.0170455 -0.0223435 -0.0645461 0.0582057 -0.009858 -0.0726169 -0.0352167 -0.1006774 -0.0596035 -0.0275031 0.10068 -0.0000002 0.1301424 -0.0615412 0.0000015 -0.0000004 0.0000019 0.118181 0.0791612 -0.0201216 0.0184055 -0.0694282 0.0365752 0.1080451 0.0481241 0.1105716 -0.0620188 0.0791583 -0.020126 -0.0184091 -0.0694334 0.0365665 -0.1080479 -0.0481267 -0.1105758 -0.062011 -0.0189727 0.0668774 -0.0000007 0.1153837 -0.1311046 0.0000035 -0.0000019 0.0000031 0.1466435 unknown
polarizability: 50.7949782|-0.030933|37.856711|0.0000104|-0.0000768|27.9063785 unknown
InChI: InChI=1S/C3H6O2/c1-2-5-3-4/h3H,2H2,1H3
charge 0 multiplicity 1
11 atoms
O  0.023878 0.705309 0.000003
O  -1.913689 -0.614271 0.000013
C  0.880752 -0.524242 0.000015
C  2.330522 -0.051234 -0.000015
C  -1.346817 0.498395 0.000001
H  0.626252 -1.122422 0.894343
H  0.626228 -1.122458 -0.894288
H  3.007161 -0.925888 -0.000007
H  2.546398 0.555382 -0.895868
H  2.546424 0.555414 0.895815
H  -1.848009 1.484713 -0.000011
