program: Gaussian 09
title: 000088843
version: EM64L-G09RevD.01
frameworkgroup: C1[X(C14H24O6P2)]
method: RPBEPBE
basis: SDD
operation: Freq
keyword: #p
keyword: freq=noraman
keyword: PBEPBE/SDD
title: #p freq=noraman PBEPBE/SDD
converged: YES YES NO NO
title: Mulliken charges:
elementType: P P O O O O O O C C C C C C C C C C C C C C H H H H H H H H H H H H H H H H H H H H H H H H
charge: 1.253910 1.253784 -0.505595 -0.505605 -0.505604 -0.505639 -0.639357 -0.639270 -0.160823 -0.160845 -0.208853 -0.208837 -0.289834 -0.289876 -0.234519 -0.234356 -0.234368 -0.234143 -0.642397 -0.642450 -0.642417 -0.642487 0.271180 0.271182 0.286757 0.286752 0.238052 0.222992 0.223024 0.237917 0.237965 0.223002 0.223039 0.237791 0.234627 0.219622 0.210699 0.219721 0.234638 0.210671 0.234637 0.219596 0.210690 0.210653 0.234649 0.219724
chargesum: 0.00000
title: Mulliken charges with hydrogens summed into heavy atoms:
elementType: P P O O O O O O C C C C C C C C C C C C C C
charge: 1.253910 1.253784 -0.505595 -0.505605 -0.505604 -0.505639 -0.639357 -0.639270 -0.160823 -0.160845 0.062327 0.062345 -0.003077 -0.003124 0.226526 0.226585 0.226599 0.226687 0.022551 0.022580 0.022507 0.022538
polarizability: 3.09895723e+02 -4.29188763e-03 1.90248190e+02 -2.82144335e-03 -8.44751604e-03 1.91085742e+02
1716.lowfreq: -40.5504 -40.0848 -24.2706 -20.1132 -6.0065 0.0006 0.0007 0.0011 3.2518
frequency: -40.5449 -40.0791 -24.2164 -17.5112 14.5239 15.3436 20.4626 22.3177 32.6034 59.2170 71.1741 72.5332 73.3384 96.8054 142.9626 152.6393 173.1540 175.2104 191.9507 200.7013 205.7079 223.7126 238.6061 245.5507 246.7126 251.4382 307.4775 315.8916 322.9596 350.5612 352.2603 353.4530 376.8959 391.6256 406.1565 413.5915 429.5467 496.1714 526.8644 549.2464 604.7792 612.3582 636.0254 657.6108 665.9734 740.6629 744.7473 799.9228 799.9871 802.2101 802.3653 837.2146 868.2596 868.5005 873.6878 873.7627 879.7437 962.1002 992.6145 1001.8559 1009.3608 1009.7531 1009.9041 1018.9352 1022.9349 1024.1162 1092.5271 1092.6126 1093.4768 1093.9166 1096.2438 1112.0897 1120.0869 1144.4423 1144.4542 1146.7148 1146.8214 1198.8727 1269.8756 1270.0520 1271.2345 1271.4258 1302.4180 1353.3016 1353.3621 1359.3108 1359.3831 1363.3223 1388.9861 1389.0517 1391.0123 1392.6217 1392.7081 1455.5724 1455.5839 1461.0427 1461.0752 1470.7192 1470.7800 1474.2347 1479.4203 1479.4451 1486.2812 1486.3852 1488.2785 1488.3517 1573.4601 1597.4604 2988.9380 2988.9510 2989.8008 2989.8653 2999.8680 2999.9210 3000.5337 3000.7217 3064.0790 3064.1521 3064.6148 3064.6858 3084.3478 3084.3809 3085.8669 3085.9280 3104.8524 3104.9100 3107.1902 3107.2162 3143.3572 3158.3401 3160.7542 3177.5233
redmass: 2.4373 2.3761 3.4269 3.6622 5.4447 3.8320 2.5816 2.5325 4.9141 3.2281 3.3059 3.1404 5.1088 3.6578 7.9308 4.4013 2.2971 3.0787 1.5771 1.5588 6.9757 6.1399 1.3663 1.4366 2.1143 2.3374 7.5217 4.5131 4.6400 3.0442 4.8991 3.2941 3.5085 2.8838 3.9119 5.9149 6.1886 9.2476 3.2276 8.5276 6.3750 6.9754 7.3405 6.1380 5.6970 4.0929 7.0596 1.1143 1.1139 1.1167 1.1165 1.4353 2.7350 3.8199 3.0259 1.5526 3.2588 1.3755 1.3536 7.6842 12.5849 2.7616 2.7745 3.5162 4.2292 3.1183 2.1395 2.1394 2.6060 2.1525 4.6944 2.2853 1.4706 1.5553 1.5553 1.5741 1.5712 1.1365 1.1140 1.1139 1.1104 1.1102 1.2450 1.2222 1.2221 1.2303 1.3054 3.8612 1.2394 1.2394 3.5403 1.2343 1.2358 1.0414 1.0414 1.0441 1.0441 1.0469 1.0469 2.0941 1.0557 1.0547 1.0795 1.0795 1.0735 1.0735 7.2388 5.9068 1.0363 1.0363 1.0364 1.0364 1.0591 1.0592 1.0591 1.0591 1.1059 1.1059 1.1059 1.1059 1.0978 1.0978 1.0971 1.0970 1.1025 1.1025 1.1020 1.1020 1.0889 1.0889 1.0974 1.0982
irintensity: 0.0233 0.7685 0.0014 1.1287 0.0003 0.4622 1.5869 0.7582 0.0018 0.0005 1.5519 1.2315 0.0001 0.0037 5.0903 5.7595 4.2168 6.1962 0.0000 10.1935 4.2195 33.6406 16.3510 1.9115 0.0124 22.1753 8.1308 0.2219 0.0001 2.5544 42.2180 0.0187 0.0248 0.0000 3.2473 13.1522 0.0002 0.0001 26.1440 114.9765 55.2542 90.5408 149.6912 0.0011 314.0011 0.0000 10.5975 3.7686 16.1037 1.9410 2.1863 4.6653 249.0366 1.6747 344.8913 142.9283 21.6848 0.0000 0.0000 28.1314 128.7025 0.4215 229.7921 292.8788 169.2496 8.5323 1.9523 23.0862 4.5786 7.0468 14.0394 67.4946 0.2611 0.4003 12.1956 1.3975 9.2749 0.0922 0.0657 0.1390 0.1348 0.1714 0.2685 0.3903 18.5534 16.9320 4.6388 6.0303 1.4647 1.7237 21.2392 43.5111 49.0776 1.9497 10.9319 12.2326 9.0492 1.0872 5.1767 3.8181 1.0695 0.9273 4.5407 7.2292 3.4752 26.5855 0.5006 0.0501 0.1248 0.2576 62.0775 30.2219 2.9788 91.9165 31.2125 16.7004 3.7614 6.4201 2.8480 1.9652 6.6924 106.4908 27.6874 30.6250 0.0134 95.9629 32.0379 18.2286 1.0158 0.5681 0.1289 0.7166
temp: 298.150 k
press: 1.00000 atm
elementType: 15 15 8 8 8 8 8 8 6 6 6 6 6 6 6 6 6 6 6 6 6 6 1 1 1 1 1 1 1 1 1 1 1 1 1 1 1 1 1 1 1 1 1 1 1 1
symmnumber: 1
zpe: 958196.6 jmol-1
zpe.correction: 0.364958 hartree
zpe.thermalcorrener: 0.389718 hartree
zpe.thermalcorrenthalpy: 0.390663 hartree
zpe.thermalcorrgfe: 0.305817 hartree
zpe.sumelectzpe: -1679.927612 hartree
zpe.sumelectthermal: -1679.902852 hartree
zpe.sumelectthermalent: -1679.901907 hartree
zpe.sumelectthermalfe: -1679.986753 hartree
dipole: 0.0023 0.0007 -3.0089
dipole: 3.0089
quadrupole: -116.8473 -134.6219 -156.5322
quadrupole: -0.0030 -0.0175 0.0028
quadrupole: 19.1531 1.3786 -20.5317 -0.0030 -0.0175 0.0028
hfenergy: -1680.2925701 hartree
pointgroup: C01 [X(C14H24O6P2)]
dipole: -0.0012849 -0.0000595 1.1837981 debye
polarizability: 309.8957122|-0.0057878|190.248186|0.0349184|0.0082223|191.0857563 unknown
InChI: InChI=1S/C14H24O6P2/c1-5-17-21(15,18-6-2)13-9-11-14(12-10-13)22(16,19-7-3)20-8-4/h9-12H,5-8H2,1-4H3
charge 0 multiplicity 1
46 atoms
P  3.238576 -0.000384 -0.584844
P  -3.239191 0.000261 -0.588182
O  3.627211 1.381815 0.396063
O  3.626417 -1.383627 0.394818
O  -3.628674 -1.382128 0.392155
O  -3.627965 1.383489 0.391156
O  3.923524 0.000232 -2.029801
O  -3.922917 -0.000307 -2.03372
C  1.397996 -0.000186 -0.522652
C  -1.398719 0.000133 -0.524113
C  0.703897 -0.000001 0.709282
C  -0.705913 0.000151 0.708547
C  0.70598 -0.000197 -1.753919
C  -0.705419 -0.000027 -1.754659
C  4.816071 2.216027 0.051121
C  4.81682 -2.216222 0.051306
C  -4.818417 -2.215102 0.047223
C  -4.819478 2.214675 0.048032
C  5.842768 2.153224 1.183132
C  5.840207 -2.155211 1.186406
C  -5.843197 -2.15426 1.181074
C  -5.839904 2.156439 1.185928
H  1.253762 0.000037 1.654734
H  -1.256774 0.000264 1.653417
H  1.265705 -0.000319 -2.695348
H  -1.26414 -0.000043 -2.696685
H  5.234693 1.875763 -0.915372
H  4.420727 3.239453 -0.073398
H  4.422599 -3.23966 -0.076634
H  5.237904 -1.873565 -0.913271
H  -5.238427 -1.872664 -0.9179
H  -4.42383 -3.238473 -0.080144
H  -4.426142 3.23796 -0.083848
H  -5.242794 1.869179 -0.914553
H  5.378021 2.43382 2.143649
H  6.268189 1.140136 1.285652
H  6.670455 2.858556 0.978056
H  6.264171 -1.141918 1.292788
H  5.372997 -2.438763 2.144857
H  6.669236 -2.859137 0.981917
H  -5.377055 -2.437401 2.140167
H  -6.267748 -1.141125 1.286667
H  -6.671698 -2.858563 0.975738
H  -6.67003 2.859049 0.98136
H  -5.370477 2.443392 2.142282
H  -6.262716 1.143129 1.296615
