program: Gaussian 09
title: 000088761
version: EM64L-G09RevD.01
frameworkgroup: C1[X(C6H4ClN3)]
method: RPBEPBE
basis: SDD
operation: Freq
keyword: #p
keyword: freq=noraman
keyword: PBEPBE/SDD
title: #p freq=noraman PBEPBE/SDD
converged: NO NO NO NO
title: Mulliken charges:
elementType: Cl N N N C C C C C C H H H H
charge: 0.210176 -0.561809 -0.097025 0.022484 0.438807 -0.000025 -0.329663 -0.272496 -0.184204 -0.213101 0.256470 0.258925 0.234641 0.236820
chargesum: 0.00000
title: Mulliken charges with hydrogens summed into heavy atoms:
elementType: Cl N N N C C C C C C
charge: 0.210176 -0.561809 -0.097025 0.022484 0.438807 -0.000025 -0.073193 -0.013571 0.050436 0.023719
polarizability: 1.36193425e+02 2.13812726e+00 1.05020533e+02 7.21141230e-03 8.40859229e-03 3.53308333e+01
1716.lowfreq: -0.0010 0.0012 0.0014 4.3415 10.2802 11.6389 112.2296 167.3981 215.4376
frequency: 112.1894 167.3954 215.4363 262.9457 369.0531 425.5245 450.3030 542.4373 544.1090 605.8617 633.3674 743.4128 761.4141 763.3849 845.8053 858.7960 872.3685 951.8171 986.1926 987.8387 1003.8258 1114.2387 1158.5922 1191.7685 1206.9414 1258.4209 1304.6541 1411.0789 1438.6057 1472.4171 1591.8217 1617.3668 3142.3795 3157.5796 3172.8084 3181.4882
redmass: 6.6106 9.5261 5.9379 6.8234 18.2300 2.9305 6.7289 4.9307 8.0205 6.1129 7.8728 4.6023 6.1319 1.3058 11.1891 1.3953 8.0600 1.3634 5.9524 1.3165 2.3730 1.6542 1.2786 10.4672 2.5143 2.6325 1.9444 2.4816 5.6482 3.1213 7.5075 7.8389 1.0865 1.0901 1.0962 1.1000
irintensity: 1.1103 0.1050 0.0487 0.0241 6.7598 7.0734 2.4154 0.4276 0.9581 0.0922 3.4236 5.9348 20.1788 105.0244 16.5007 0.0003 2.0061 2.2737 64.4431 0.0189 17.8070 0.0047 4.0315 16.6044 24.5905 3.4668 6.9270 8.0439 4.1331 7.3335 4.0476 11.1297 3.4525 8.1714 6.8792 10.7458
temp: 298.150 k
press: 1.00000 atm
elementType: 17 7 7 7 6 6 6 6 6 6 1 1 1 1
symmnumber: 1
zpe: 242385.2 jmol-1
zpe.correction: 0.092320 hartree
zpe.thermalcorrener: 0.099810 hartree
zpe.thermalcorrenthalpy: 0.100754 hartree
zpe.thermalcorrgfe: 0.059512 hartree
zpe.sumelectzpe: -854.576751 hartree
zpe.sumelectthermal: -854.569261 hartree
zpe.sumelectthermalent: -854.568317 hartree
zpe.sumelectthermalfe: -854.609558 hartree
dipole: 2.1408 -3.8567 -0.0004
dipole: 4.4110
quadrupole: -55.4257 -66.0432 -66.3550
quadrupole: 3.7516 0.0015 0.0000
quadrupole: 7.1823 -3.4352 -3.7471 3.7516 0.0015 0.0000
hfenergy: -854.6690706 hartree
pointgroup: C01 [X(C6H4Cl1N3)]
dipole: 1.1638338 -1.2873021 -0.0001683 debye
dipolederiv: -0.2191825 -0.207214 -0.0000517 -0.3047911 -0.3072515 -0.0000761 -0.0001664 -0.0001334 0.124173 0.2497886 0.422456 0.0001357 0.4700817 0.1247467 0.0001315 0.0003418 0.000186 -0.1339924 -0.2136712 -0.5694075 -0.000078 -0.2247767 -0.4211187 -0.0000547 -0.0000054 -0.0000158 -0.153798 -0.4750185 0.064429 -0.0000325 0.2705995 0.7743129 0.0000967 -0.0000647 0.0000658 -0.1093464 0.4777679 0.1498971 0.0000178 -0.2515788 -0.2047237 -0.000079 -0.0000769 -0.0000768 0.1247198 0.0296237 0.2018638 0.0000124 -0.1040545 -0.2330591 -0.0000387 -0.0000545 -0.0000477 0.0542008 -0.099628 -0.0624798 -0.0000022 0.0485854 0.0870466 0.0000199 0.0000133 0.0000157 -0.1645836 0.1352343 -0.0681909 0.0000053 0.017279 0.1464347 0.0000295 0.0000147 0.0000416 -0.1115497 0.0075989 0.0181407 -0.0000024 -0.0646363 0.1939621 0.000032 -0.0000007 0.0000437 -0.1399705 0.0741974 0.0788615 0.0000112 0.1448755 -0.195802 0.0000038 0.0000103 -0.0000041 -0.1704656 0.0632874 -0.0672734 -0.0000084 -0.0196866 -0.0184975 -0.000017 -0.0000144 -0.0000197 0.1880542 0.0742836 -0.0245373 -0.0000063 -0.0552184 -0.0175081 -0.0000237 0.0000008 -0.0000264 0.167569 0.0033371 0.0980422 0.0000074 0.0968645 -0.0178462 -0.0000159 0.0000113 -0.0000188 0.1582872 -0.1076188 -0.0345871 -0.0000085 -0.0235434 0.0893036 -0.0000081 -0.0000092 -0.0000101 0.1667022 unknown
polarizability: 133.653417|8.7920047|107.5605408|0.0051209|0.0098227|35.3308333 unknown
InChI: InChI=1S/C6H4ClN3/c7-10-6-4-2-1-3-5(6)8-9-10/h1-4H
charge 0 multiplicity 1
14 atoms
Cl -2.795224 -1.569855 -0.000448
N  -1.570832 -0.262428 -0.000023
N  -0.813055 1.807309 0.000208
N  -1.957511 1.108693 0.000103
C  -0.191401 -0.432814 -0.000032
C  0.287804 0.914125 0.00011
C  0.672288 -1.550455 -0.000119
C  1.677529 1.18482 0.000164
C  2.049469 -1.262949 -0.000074
C  2.54672 0.080937 0.000066
H  0.294725 -2.576745 -0.000209
H  2.042646 2.215938 0.000303
H  2.767171 -2.090357 -0.000151
H  3.629372 0.242982 0.000101
