program: Gaussian 09
title: 000008024
version: EM64L-G09RevD.01
frameworkgroup: C1[X(C4H6O)]
method: RPBEPBE
basis: SDD
operation: Freq
keyword: #p
keyword: freq=noraman
keyword: PBEPBE/SDD
title: #p freq=noraman PBEPBE/SDD
converged: NO NO NO NO
title: Mulliken charges:
elementType: O C C C C H H H H H H
charge: -0.248918 0.049588 0.049534 -0.587844 -0.587931 0.202073 0.201896 0.224008 0.236811 0.223953 0.236830
chargesum: 0.00000
title: Mulliken charges with hydrogens summed into heavy atoms:
elementType: O C C C C
charge: -0.248918 0.251660 0.251430 -0.127025 -0.127148
polarizability: 9.14209180e+01 -3.12853177e-03 3.98619763e+01 -8.37736214e-04 2.90925852e-04 1.97549828e+01
1716.lowfreq: -0.0010 -0.0005 0.0008 9.6309 11.6676 46.7041 96.9445 125.1662 215.7288
frequency: 96.8181 125.1638 215.7288 463.7602 496.1138 657.1456 689.5738 809.3595 867.9851 873.6156 929.8123 946.6896 998.9426 1138.7931 1158.2406 1289.1766 1323.3874 1388.6045 1401.9782 1628.5922 1681.2195 3079.2099 3085.7567 3129.8556 3130.5840 3243.2472 3243.7419
redmass: 5.4949 1.6981 2.7556 2.2184 3.7214 1.4774 1.4645 2.0390 1.4103 1.4047 1.0879 1.1147 1.7800 2.5201 4.2427 1.1344 1.1809 1.2021 1.1542 4.6853 4.8107 1.0877 1.0849 1.0684 1.0701 1.1163 1.1161
irintensity: 3.1081 0.0000 0.1451 4.9558 0.0081 12.6145 0.0000 0.4420 0.0001 182.6226 0.0106 96.6527 12.7640 19.3628 391.5046 5.0326 4.9548 25.8069 3.2253 435.1278 2.3978 10.3808 45.0594 0.3193 2.4799 4.7272 13.8685
temp: 298.150 k
press: 1.00000 atm
elementType: 8 6 6 6 6 1 1 1 1 1 1
symmnumber: 1
zpe: 227847.3 jmol-1
zpe.correction: 0.086782 hartree
zpe.thermalcorrener: 0.092717 hartree
zpe.thermalcorrenthalpy: 0.093661 hartree
zpe.thermalcorrgfe: 0.057867 hartree
zpe.sumelectzpe: -230.791249 hartree
zpe.sumelectthermal: -230.785314 hartree
zpe.sumelectthermalent: -230.784370 hartree
zpe.sumelectthermalfe: -230.820165 hartree
dipole: 0.0017 1.6993 0.0000
dipole: 1.6993
quadrupole: -26.4208 -26.9888 -34.6077
quadrupole: -0.0007 -0.0001 0.0001
quadrupole: 2.9183 2.3503 -5.2686 -0.0007 -0.0001 0.0001
hfenergy: -230.8780315 hartree
pointgroup: C01 [X(C4H6O1)]
dipole: -0.0010831 0.6685695 -0.0000099 debye
dipolederiv: -2.1748264 -0.0012055 0.0000238 -0.0011087 -0.3378193 0.000002 0.000023 0.0000022 -0.1673199 1.6403617 -0.049477 -0.0000189 -0.5725448 0.3428344 0.0000029 -0.0000115 -0.0000029 -0.0384944 1.6401459 0.051131 -0.0000206 0.5744227 0.3439068 -0.0000127 -0.0000283 -0.0000064 -0.0385654 -0.647098 -0.0664512 0.0000035 -0.2021822 -0.0159864 -0.0000044 0.0000087 -0.0000062 -0.509028 -0.6477027 0.0655746 0.0000013 0.2009894 -0.0153597 -0.0000097 0.0000002 -0.0000081 -0.5092217 0.014152 -0.0655963 0.0000027 0.052302 -0.1352911 0.0000032 0.0000011 0.0000043 0.1917927 0.0140523 0.0656821 0.0000011 -0.0521148 -0.1356421 0.0000055 0.0000029 0.000004 0.1917081 -0.0225163 0.0786047 0.0000009 0.0718283 0.0352561 0.0000017 -0.0000004 0.0000018 0.2037018 0.1028557 0.0112374 0.0000011 0.0095157 -0.0582591 0.0000034 0.0000002 0.0000034 0.2358527 -0.0223175 -0.0786836 0.0000035 -0.0720041 0.0347394 0.0000033 0.0000029 0.0000033 0.2036612 0.1028933 -0.0108162 0.0000015 -0.0091034 -0.0583789 0.0000046 0.0000012 0.0000047 0.235913 unknown
polarizability: 91.4208947|0.034772|39.8619996|-0.0008376|-0.0002914|19.7549828 unknown
InChI: InChI=1S/C4H6O/c1-3-5-4-2/h3-4H,1-2H2
charge 0 multiplicity 1
11 atoms
O  -0.000191 -0.306785 0.000024
C  -1.207555 0.414044 0.000028
C  1.206294 0.415031 -0.000001
C  -2.402093 -0.219993 0.000051
C  2.401942 -0.216943 -0.000005
H  -1.106282 1.510667 0.000014
H  1.104358 1.511699 -0.000016
H  -3.324343 0.366189 0.000051
H  -2.47251 -1.310861 0.000065
H  3.322808 0.371411 -0.000023
H  2.474973 -1.307659 0.000011
