program: Gaussian 09
title: 000008023
version: EM64L-G09RevD.01
frameworkgroup: C1[X(C4H8O)]
method: RPBEPBE
basis: SDD
operation: Freq
keyword: #p
keyword: freq=noraman
keyword: PBEPBE/SDD
title: #p freq=noraman PBEPBE/SDD
converged: YES YES NO NO
title: Mulliken charges:
elementType: O C C C C H H H H H H H H
charge: -0.255498 -0.238702 -0.671797 0.040905 -0.596870 0.204338 0.204710 0.204872 0.232989 0.232930 0.195469 0.219954 0.226698
chargesum: 0.00000
title: Mulliken charges with hydrogens summed into heavy atoms:
elementType: O C C C C
charge: -0.255498 0.170347 -0.001006 0.236374 -0.150217
polarizability: 7.25904625e+01 5.93882545e+00 4.24565293e+01 4.80146543e-03 -3.23008174e-02 3.09289236e+01
1716.lowfreq: -1.9160 -0.0006 -0.0003 0.0007 7.7604 29.1476 56.4979 89.1257 195.3391
frequency: 54.8867 88.7528 195.3379 239.8481 414.9326 471.4504 671.0120 797.4249 814.9360 854.4493 943.6215 965.3475 1057.6233 1109.3035 1133.1928 1159.4193 1259.5964 1309.5731 1358.6525 1396.7781 1408.0564 1459.5690 1476.9567 1489.3097 1654.7583 2952.0676 2998.0335 3009.5630 3074.4579 3095.3310 3107.0116 3126.2478 3239.1512
redmass: 1.6685 4.3386 2.7510 1.1338 2.9215 2.7915 1.4693 2.2657 1.0891 1.4405 1.0989 1.9663 3.2444 2.3151 1.4264 3.0455 1.1463 1.1634 1.2670 1.2144 1.2334 1.0397 1.0580 1.0749 4.5786 1.0554 1.0362 1.1078 1.0869 1.0988 1.1013 1.0674 1.1159
irintensity: 0.2334 5.2900 0.6647 0.5849 3.2284 2.3319 7.7462 1.5411 5.9066 85.2997 48.3512 17.9484 83.6260 72.9828 5.1007 177.2446 0.2448 1.5254 40.8604 26.1040 11.1005 11.0458 11.6197 6.8143 149.9149 66.3385 21.0887 47.5488 32.8150 35.5725 37.6194 0.4688 13.8405
temp: 298.150 k
press: 1.00000 atm
elementType: 8 6 6 6 6 1 1 1 1 1 1 1 1
symmnumber: 1
zpe: 289416.5 jmol-1
zpe.correction: 0.110233 hartree
zpe.thermalcorrener: 0.116848 hartree
zpe.thermalcorrenthalpy: 0.117793 hartree
zpe.thermalcorrgfe: 0.079925 hartree
zpe.sumelectzpe: -231.989909 hartree
zpe.sumelectthermal: -231.983293 hartree
zpe.sumelectthermalent: -231.982349 hartree
zpe.sumelectthermalfe: -232.020216 hartree
dipole: 1.2823 1.7722 -0.0012
dipole: 2.1874
quadrupole: -28.5624 -29.9148 -33.4188
quadrupole: -0.0737 0.0092 -0.0149
quadrupole: 2.0696 0.7172 -2.7868 -0.0737 0.0092 -0.0149
hfenergy: -232.1001415 hartree
pointgroup: C01 [X(C4H8O1)]
dipole: 0.5033197 0.6979861 -0.0110416 debye
dipolederiv: -1.7963557 -0.1851484 -0.0002892 0.3593677 -0.323776 0.0014748 -0.0097246 0.0008781 -0.2969537 0.9960906 0.1960518 -0.0010869 0.3876056 0.3825598 0.0017884 -0.0048317 0.0009125 0.4363498 -0.1203908 0.0685429 -0.0010589 0.0674546 0.0107467 0.0003862 -0.0009742 0.0004033 0.0474316 1.4389642 0.0647028 0.0018463 -0.5131123 0.2635733 -0.0079738 0.0123038 -0.0067269 -0.043478 -0.5838343 -0.1154885 0.0023331 -0.2121447 -0.0220252 -0.0110724 0.0043705 -0.0112063 -0.5366089 -0.0452307 0.0111966 -0.0309083 -0.0953945 -0.0664541 0.1162011 0.0286523 0.1525451 -0.1095872 -0.0455298 0.0116715 0.0301631 -0.0967595 -0.0732872 -0.1174313 -0.0262959 -0.153486 -0.1028223 -0.119693 -0.0989857 0.0010099 -0.1238694 0.008733 0.00123 0.001317 0.0012281 0.114434 0.1053147 0.0002414 0.0151799 0.0452987 0.0144033 0.1072287 -0.0123716 0.1172057 -0.0646384 0.1053442 0.00009 -0.0149396 0.0456707 0.0087322 -0.1090248 0.0114559 -0.1190454 -0.0590656 0.0163056 -0.0441943 0.0006013 0.0539257 -0.155098 0.0069308 -0.0011035 0.0069274 0.1767805 -0.0464331 0.0771444 -0.002214 0.0782855 0.0308251 0.0038491 -0.0024224 0.0039879 0.2070392 0.0954482 0.0141755 -0.0006369 0.0036721 -0.0789328 0.0064131 -0.0003755 0.0063766 0.2311189 unknown
polarizability: 72.570141|5.9902492|42.472907|-0.0241143|-0.2110086|30.9328672 unknown
InChI: InChI=1S/C4H8O/c1-3-5-4-2/h3H,1,4H2,2H3
charge 0 multiplicity 1
13 atoms
O  -0.000556 -0.287155 0.066055
C  1.195951 0.584338 0.055879
C  2.418552 -0.329422 0.067908
C  -1.229472 0.38539 0.050297
C  -2.41296 -0.274729 0.061283
H  1.179775 1.220217 -0.853711
H  1.178683 1.242559 0.949358
H  3.345801 0.272027 0.061074
H  2.418088 -0.96466 0.969977
H  2.419131 -0.986795 -0.818142
H  -1.175584 1.486024 0.027907
H  -3.349837 0.287233 0.04739
H  -2.458273 -1.367226 0.083626
