program: Gaussian 09
title: 000088737
version: EM64L-G09RevD.01
frameworkgroup: C1[X(C7H12BrN)]
method: RPBEPBE
basis: SDD
operation: Freq
keyword: #p
keyword: freq=noraman
keyword: PBEPBE/SDD
title: #p freq=noraman PBEPBE/SDD
converged: NO YES NO NO
title: Mulliken charges:
elementType: Br N C C C C C C C H H H H H H H H H H H H
charge: -0.040751 -0.017474 -0.357356 -0.375402 -0.377921 -0.311737 -0.428782 -0.695476 -0.156416 0.199924 0.199861 0.202101 0.202370 0.222513 0.222458 0.227637 0.227436 0.249150 0.249164 0.279304 0.279396
chargesum: 0.00000
title: Mulliken charges with hydrogens summed into heavy atoms:
elementType: Br N C C C C C C C
charge: -0.040751 -0.017474 0.042429 0.029069 0.067050 0.143336 0.069532 -0.136776 -0.156416
polarizability: 1.45352770e+02 1.42213796e+01 7.52856477e+01 2.57113927e-03 6.99836624e-03 6.32944133e+01
1716.lowfreq: -7.2801 0.0005 0.0006 0.0006 5.4423 7.6552 32.4013 53.2159 66.0220
frequency: 31.9782 53.2061 65.8518 86.7754 119.1336 129.9580 143.3897 195.1566 234.1848 375.6817 384.3532 400.5322 542.2383 620.4989 727.2201 741.6574 771.2013 849.0441 920.6364 951.2497 993.3752 1023.9057 1048.1094 1049.9898 1073.3594 1081.9738 1120.6154 1208.5361 1211.6007 1244.0648 1258.6217 1281.0781 1287.6339 1295.0329 1297.6667 1323.3996 1347.2649 1357.2066 1448.2568 1451.8033 1465.1024 1466.4593 1475.8493 1486.1656 2194.1437 2959.7120 2967.0183 2985.3593 2995.9504 2997.5532 3000.3614 3023.3237 3036.2878 3048.4006 3058.8139 3067.2958 3133.3176
redmass: 6.2174 6.5560 1.9762 2.8400 8.3310 2.0071 2.2042 6.3210 4.7295 3.5485 4.5715 3.6666 5.3165 5.0044 1.0723 1.0985 1.1852 1.2900 5.4805 1.2829 5.0126 4.0223 1.1270 3.5635 2.3585 3.7748 1.3289 1.1746 1.4729 1.2365 1.2586 1.0827 1.2974 1.0979 1.0909 1.3564 1.4335 1.5742 1.0832 1.1028 1.0778 1.0678 1.0951 1.1002 12.4306 1.0590 1.0590 1.0590 1.0593 1.0590 1.0992 1.1027 1.1020 1.0564 1.1045 1.1047 1.1112
irintensity: 6.2913 5.1319 2.7613 0.7318 0.7775 0.1782 0.7480 2.3723 2.7623 0.5189 6.4453 0.9979 2.6300 34.8525 12.9210 2.9956 4.1045 0.4387 1.9955 0.8388 0.9821 6.5362 1.4130 2.9130 0.1608 1.4583 0.0001 6.9604 0.3570 39.1242 1.0349 0.0885 14.6186 0.0462 0.5418 13.2390 2.1306 0.5463 6.1133 4.0166 0.7423 0.7190 0.1784 24.9407 14.9318 2.6616 39.6229 0.4294 11.4101 55.7368 0.1826 15.1722 2.6191 23.6162 9.9480 89.5403 17.7250
temp: 298.150 k
press: 1.00000 atm
elementType: 35 7 6 6 6 6 6 6 6 1 1 1 1 1 1 1 1 1 1 1 1
symmnumber: 1
zpe: 461211.6 jmol-1
zpe.correction: 0.175666 hartree
zpe.thermalcorrener: 0.187008 hartree
zpe.thermalcorrenthalpy: 0.187952 hartree
zpe.thermalcorrgfe: 0.135597 hartree
zpe.sumelectzpe: -341.423711 hartree
zpe.sumelectthermal: -341.412369 hartree
zpe.sumelectthermalent: -341.411425 hartree
zpe.sumelectthermalfe: -341.463781 hartree
dipole: -1.4184 -0.7158 0.0175
dipole: 1.5889
quadrupole: -118.3507 -63.3668 -63.5410
quadrupole: -10.8658 0.0651 0.0111
quadrupole: -36.5979 18.3861 18.2118 -10.8658 0.0651 0.0111
hfenergy: -341.5993772 hartree
pointgroup: C01 [X(C7H12Br1N1)]
dipole: -0.5531511 0.291071 -0.0080131 debye
dipolederiv: -0.6659371 0.0540493 -0.0004941 0.1826413 -0.2002826 0.0000226 0.0004826 -0.0002487 -0.153662 -0.3627426 -0.0050697 0.0001502 0.0976546 -0.2320607 -0.0000703 -0.0009788 -0.0000773 -0.2367726 -0.0458962 -0.0040635 -0.0004473 0.0463348 0.0795154 0.0002596 -0.0005306 0.0003251 0.1850492 -0.1016354 -0.0027951 -0.0005199 -0.1839608 0.1083787 -0.0002082 -0.0006178 0.0004206 0.1903684 0.0782298 0.0353588 -0.0002924 0.0602239 0.0552124 0.0008865 -0.0005149 0.0006577 0.1689423 -0.2400357 -0.0146168 -0.0006791 0.1478733 0.0085371 -0.0006277 -0.0001154 -0.0011889 0.1362395 -0.1142048 0.0487423 -0.0010225 0.052736 0.1414733 0.000561 -0.0008054 0.0006483 0.2472197 0.862852 -0.2150117 0.0001092 -0.2345546 0.2178237 0.0001747 -0.0005418 0.0003017 0.1290816 0.1562801 -0.1180929 0.0008807 -0.237682 -0.016661 -0.0004842 0.0018384 -0.0004009 -0.0637822 0.03519 0.0052569 0.0070276 -0.0001128 -0.0349288 -0.1107512 0.0008032 -0.1317548 -0.0790913 0.035229 0.0046312 -0.0065612 -0.0005522 -0.0334647 0.1105213 -0.0004321 0.1315358 -0.0807276 0.0572307 0.0041226 0.0092961 0.0101932 -0.0336908 -0.1096893 0.0109983 -0.1333292 -0.0767761 0.0564634 0.0042966 -0.009099 0.0104013 -0.0332304 0.1095675 -0.0110973 0.133169 -0.0771466 0.0467875 -0.0101019 -0.0032572 -0.0003132 -0.0128056 0.0989731 -0.011736 0.1166737 -0.0614768 0.0467702 -0.0098948 0.0035557 -0.0000009 -0.0148591 -0.0994533 0.0119483 -0.1171573 -0.059511 0.0660193 0.0023291 -0.0051207 -0.0160928 -0.0116466 -0.0993424 0.0040108 -0.1092782 -0.0565933 0.0660973 0.0013514 0.0057996 -0.0167436 -0.0135833 0.0998552 -0.0033028 0.1097856 -0.0550945 0.054507 0.0286575 -0.0073846 0.0086021 0.0331079 0.0740448 0.0057227 0.1050018 -0.0105478 0.0544484 0.0293406 0.0073155 0.0090383 0.0310851 -0.0743922 -0.0055497 -0.1053133 -0.0085385 -0.042745 0.0809388 -0.0346254 0.0320033 -0.0201571 0.0875484 0.0140464 0.100972 -0.0175647 -0.0429081 0.0805715 0.0353687 0.032311 -0.0177629 -0.087396 -0.013628 -0.1007427 -0.0196157 unknown
polarizability: 144.8478837|-15.4061997|75.7902941|0.14102|-0.0283699|63.2946529 unknown
InChI: InChI=1S/C7H12BrN/c8-6-4-2-1-3-5-7-9/h1-6H2
charge 0 multiplicity 1
21 atoms
Br -5.475935 0.303183 -0.019252
N  4.953242 -0.480241 0.001858
C  0.042011 0.509595 -0.01394
C  -1.163811 -0.458594 -0.013382
C  1.396204 -0.232192 -0.008857
C  -2.518408 0.296543 -0.01471
C  2.592318 0.761332 -0.011935
C  -3.693787 -0.682424 -0.022557
C  3.900845 0.084006 -0.005076
H  -0.021123 1.173567 0.872874
H  -0.017636 1.167881 -0.905238
H  -1.103605 -1.120223 -0.901834
H  -1.10475 -1.118105 0.876672
H  1.467717 -0.883456 0.882998
H  1.469779 -0.891788 -0.894365
H  -2.584382 0.947668 0.877416
H  -2.578647 0.955428 -0.901568
H  2.538297 1.414613 -0.904737
H  2.534327 1.424587 0.873244
H  -3.728255 -1.316048 0.877585
H  -3.726002 -1.304932 -0.930496
