program: Gaussian 09
title: 000088736
version: EM64L-G09RevD.01
frameworkgroup: C1[X(C12H10O3)]
method: RPBEPBE
basis: SDD
operation: Freq
keyword: #pfreq=noraman
keyword: PBEPBE/SDD
title: #p freq=noraman PBEPBE/SDD
converged: YES YES NO NO
title: Mulliken charges:
elementType: O O O C C C C C C C C C C C C H H H H H H H H H H
charge: -0.441775 -0.439778 -0.437655 0.448517 0.364332 -0.559305 -0.617167 -0.505706 -0.419307 0.356531 0.345293 0.295828 -0.551947 -0.199852 -0.410216 0.268373 0.234172 0.268226 0.238612 0.248432 0.224557 0.222299 0.355857 0.357083 0.354597
chargesum: 0.00000
title: Mulliken charges with hydrogens summed into heavy atoms:
elementType: O O O C C C C C C C C C C C C
charge: -0.085918 -0.082695 -0.083058 0.448517 0.364332 -0.290932 -0.382995 -0.237480 -0.180695 0.356531 0.345293 0.295828 -0.303515 0.024705 -0.187917
polarizability: 2.21835060e+02 -3.72098335e+00 1.51507276e+02 2.01563449e+00 -4.33979636e+00 6.54495791e+01
1716.lowfreq: -7.1903 -2.3704 -0.0008 -0.0004 0.0005 2.0658 41.3980 80.0858 96.0029
frequency: 41.3944 80.0831 96.0005 212.6767 222.7258 236.4119 244.3122 250.8824 289.5214 337.9993 354.0126 361.0114 368.2204 418.3456 444.7790 496.5869 514.3703 520.0615 530.5301 575.3834 593.5520 630.8951 645.3845 685.6992 697.6455 778.8440 785.5421 820.7998 836.5632 863.2831 873.8762 892.5417 936.5397 959.5970 976.3281 979.8971 985.5310 1067.9801 1090.8219 1127.4517 1145.2348 1148.4509 1178.2888 1188.3485 1194.8076 1254.9630 1286.2634 1299.4199 1348.5622 1383.2023 1395.9804 1449.9292 1469.3712 1473.0521 1508.3415 1584.8092 1608.8191 1627.6084 1630.8697 3117.2987 3126.9363 3138.1989 3149.7868 3159.5342 3165.2562 3173.7090 3583.6832 3584.7525 3585.3742
redmass: 6.1089 4.9312 5.6998 5.8517 4.3976 4.3190 4.4742 5.4209 6.0170 5.2629 1.1244 1.1132 1.1100 3.8436 3.2286 4.5844 4.9778 7.2638 8.1238 4.1179 4.3600 3.6432 7.5121 1.9896 1.8964 1.5666 8.0121 1.4644 1.7539 1.4712 1.5148 1.6282 3.9322 1.3423 4.3761 6.1856 5.8305 1.8509 1.6087 1.4804 1.3454 1.3334 1.1072 1.2806 1.5197 2.6652 1.3346 1.3457 5.1836 6.2763 7.3941 3.2276 2.5927 3.1649 3.3754 6.1190 6.5925 6.3019 6.4068 1.0882 1.0912 1.0899 1.0926 1.0971 1.0936 1.0920 1.0660 1.0660 1.0660
irintensity: 0.0235 2.9329 0.5447 0.6851 1.4465 1.7599 0.4512 5.0732 3.6078 14.6596 4.0246 103.8076 321.6716 9.9416 2.5496 8.2284 7.5537 1.9756 2.2257 4.7292 2.2608 0.8246 8.4075 40.2618 12.7595 66.2168 55.8200 2.3660 48.6120 21.6770 22.0369 14.8720 52.0058 2.4270 79.1026 4.6090 2.3704 20.0670 22.1396 205.3109 225.9408 112.2192 2.5965 52.3767 24.0205 65.6892 17.5518 30.1173 15.8717 9.5308 11.0827 43.3551 74.7609 10.5632 26.5702 133.2560 145.3753 63.7919 135.0146 10.8914 7.7261 17.5494 4.2731 20.1103 0.6868 0.5988 41.3562 42.9776 31.5960
temp: 298.150 k
press: 1.00000 atm
elementType: 8 8 8 6 6 6 6 6 6 6 6 6 6 6 6 1 1 1 1 1 1 1 1 1 1
symmnumber: 1
zpe: 495163.9 jmol-1
zpe.correction: 0.188598 hartree
zpe.thermalcorrener: 0.201432 hartree
zpe.thermalcorrenthalpy: 0.202376 hartree
zpe.thermalcorrgfe: 0.149495 hartree
zpe.sumelectzpe: -687.884727 hartree
zpe.sumelectthermal: -687.871894 hartree
zpe.sumelectthermalent: -687.870949 hartree
zpe.sumelectthermalfe: -687.923830 hartree
dipole: 1.2376 -2.4431 0.0716
dipole: 2.7396
quadrupole: -63.3282 -80.9260 -92.5854
quadrupole: -5.6752 0.6000 0.1558
quadrupole: 15.6183 -1.9795 -13.6389 -5.6752 0.6000 0.1558
hfenergy: -688.0733253 hartree
pointgroup: C01 [X(C12H10O3)]
dipole: -0.4990165 0.9551078 0.0219659 debye
dipolederiv: -0.6500738 -0.604156 0.1468717 -0.7275007 -0.9169409 0.1549936 0.1783751 0.1534681 -0.4734104 -0.4352817 0.5141844 -0.1154749 0.6805056 -1.1519313 0.1316486 -0.1510677 0.1378865 -0.4492268 -0.7044613 -0.5702028 -0.2310331 -0.7708156 -0.813567 -0.1688788 -0.3116772 -0.1687261 -0.4967052 0.4113008 0.004909 -0.0246705 -0.0421616 0.3637368 -0.0994708 -0.0161465 -0.0599606 0.0536487 0.4122346 0.0158838 0.0143829 -0.0667306 0.1632027 0.0864932 -0.0161974 0.0475523 0.0315584 -0.5043695 0.329259 -0.0711092 0.1120933 -0.2814298 -0.0051836 -0.0561616 -0.0101185 -0.1985952 -0.5789209 -0.3166375 0.0953173 -0.0085061 -0.2430835 -0.0206602 0.0766125 -0.005783 -0.2525202 -0.4245396 -0.2599211 -0.1171587 -0.01378 -0.099631 0.043638 -0.0564205 0.0345942 -0.1450167 -0.3272627 0.0946709 0.0591643 0.0862638 -0.1419842 0.0394188 0.0908349 0.0382024 -0.1706755 0.79329 0.5276195 -0.1554813 0.547716 0.9872717 -0.2266689 -0.1995428 -0.2236203 0.187388 0.7267529 -0.5157242 0.0813929 -0.5757272 1.1506498 -0.2074971 0.1296449 -0.2072318 0.147759 0.7704983 0.5666257 0.2351501 0.7465791 0.7300656 0.2679215 0.3379727 0.2626054 0.195862 -0.1763824 -0.0456683 0.0049049 -0.0139316 -0.5699978 0.0829575 -0.0048726 0.0721849 -0.2719799 0.2155299 -0.0600993 -0.0240391 0.046448 0.1075363 0.0935229 -0.0101333 0.0980424 -0.0793211 -0.1254295 0.0503609 0.0224057 -0.2742942 -0.2983981 -0.0404875 -0.1119825 -0.0294833 -0.2376231 0.0681653 -0.0760255 0.026608 -0.0752746 0.0308631 0.0407443 0.0353736 0.0303492 0.1533423 0.0844947 0.0562138 -0.0088733 0.0478652 -0.069433 0.0632929 -0.0203775 0.0529891 0.1559885 0.1046965 0.0620623 0.0260775 0.0578886 0.0126973 -0.064103 0.0354969 -0.0506176 0.1307654 0.0309673 -0.09919 -0.0477715 -0.0888314 0.0109047 -0.0675729 -0.0560281 -0.0563815 0.1237562 -0.0715986 0.0390884 0.0067809 0.0558482 0.0829788 0.0224253 0.0046823 0.018353 0.1892188 0.0307879 0.0691317 0.0276153 0.0891931 -0.0555324 -0.0851458 0.0351412 -0.0874404 0.1173105 -0.1536423 -0.0004407 -0.0034363 -0.025423 0.0928935 -0.0354823 -0.0085108 -0.0311096 0.1646563 0.203222 0.1927678 -0.028675 0.1792814 0.2715675 0.01337 -0.0284698 0.0067727 0.3768031 0.1185975 -0.0954771 0.0357795 -0.1693741 0.3499795 0.0146982 0.0484816 0.0116826 0.3770045 0.1814247 0.1207653 0.0452719 0.2026684 0.2875818 -0.0339738 0.0749727 -0.0342101 0.3700123 unknown
polarizability: 221.9212324|-2.8486276|151.4735711|-1.9148859|3.7920549|65.3971119 unknown
InChI: InChI=1S/C12H10O3/c13-10-3-1-2-8(4-10)9-5-11(14)7-12(15)6-9/h1-7,13-15H
charge 0 multiplicity 1
25 atoms
O  3.633642 2.116719 -0.584084
O  3.02637 -2.582356 0.482404
O  -3.986571 -1.714937 -0.718622
C  0.519873 0.107173 0.042179
C  -0.963327 0.271993 0.09504
C  1.111197 -1.157549 0.278722
C  1.354851 1.221999 -0.245897
C  -1.816547 -0.778539 -0.325412
C  -1.5481 1.481775 0.566658
C  2.756113 1.05621 -0.293012
C  2.515619 -1.298267 0.226732
C  -3.218018 -0.623246 -0.274307
C  3.3558 -0.199648 -0.057051
C  -2.949501 1.627578 0.611669
C  -3.799756 0.580184 0.192066
H  0.50561 -2.030047 0.537441
H  0.907181 2.197564 -0.471546
H  -1.409984 -1.712782 -0.723825
H  -0.90671 2.289927 0.932908
H  4.446756 -0.28962 -0.101913
H  -3.388267 2.558514 0.987114
H  -4.89036 0.698822 0.228749
H  3.129978 2.953907 -0.738409
H  4.014307 -2.585894 0.431926
H  -4.953156 -1.514181 -0.655128
