program: Gaussian 09
title: 000088728
version: EM64L-G09RevD.01
frameworkgroup: C1[X(C7H5ClN2)]
method: RPBEPBE
basis: SDD
operation: Freq
keyword: #p
keyword: freq=noraman
keyword: PBEPBE/SDD
title: #p freq=noraman PBEPBE/SDD
converged: NO NO NO NO
title: Mulliken charges:
elementType: Cl N N C C C C C C C H H H H H
charge: -0.011238 -0.686147 -0.024094 0.536058 -0.408208 -0.417028 0.507197 -0.284900 -0.349538 -0.243043 0.253166 0.231445 0.258169 0.318704 0.319459
chargesum: 0.00000
title: Mulliken charges with hydrogens summed into heavy atoms:
elementType: Cl N N C C C C C C C
charge: -0.011238 -0.047985 -0.024094 0.536058 -0.155042 -0.185582 0.507197 -0.284900 -0.091369 -0.243043
polarizability: 1.60634651e+02 8.97095743e+00 1.01579627e+02 5.01573306e-03 -8.12586574e-04 3.79132662e+01
1716.lowfreq: -13.5383 -3.1325 -0.0042 -0.0025 -0.0017 10.1168 95.2360 131.9486 173.0835
frequency: 95.2137 131.9357 173.0784 229.1080 252.2675 370.3894 385.4624 405.7298 428.1281 437.5660 445.3421 501.5412 582.8394 604.2368 680.0777 706.4265 725.7132 823.8233 859.2687 888.8295 960.3440 1022.7635 1036.5650 1153.4373 1215.1934 1258.2299 1337.4856 1371.3862 1446.7383 1509.5360 1552.1094 1635.1017 1650.5665 2168.2814 3138.8920 3151.5282 3165.9527 3561.4078 3700.1177
redmass: 5.8977 14.4491 5.3208 6.3989 5.6149 12.2184 3.9639 1.0972 1.8950 6.6777 1.5079 8.9361 7.1640 3.3996 7.2630 6.1739 3.2429 1.4686 1.6684 5.6127 1.3686 3.1757 1.4640 1.2907 2.1973 1.6151 2.5943 4.0662 4.8494 3.7829 6.9735 3.2742 1.4413 12.6182 1.0885 1.0925 1.0973 1.0454 1.1041
irintensity: 0.0302 1.3343 1.7488 0.1230 4.9253 4.8647 1.7198 2.9123 109.7507 0.8325 203.3121 9.9548 5.4452 4.5049 7.1325 7.4066 1.4144 44.9929 43.4535 29.6474 0.3891 42.5049 2.0863 2.1877 0.6085 30.6140 37.0271 18.9413 5.7506 79.9550 36.2070 136.7616 401.8522 76.9318 8.9005 4.3614 6.9168 118.1557 27.7796
temp: 298.150 k
press: 1.00000 atm
elementType: 17 7 7 6 6 6 6 6 6 6 1 1 1 1 1
symmnumber: 1
zpe: 273721.2 jmol-1
zpe.correction: 0.104255 hartree
zpe.thermalcorrener: 0.113174 hartree
zpe.thermalcorrenthalpy: 0.114118 hartree
zpe.thermalcorrgfe: 0.070073 hartree
zpe.sumelectzpe: -838.604242 hartree
zpe.sumelectthermal: -838.595322 hartree
zpe.sumelectthermalent: -838.594378 hartree
zpe.sumelectthermalfe: -838.638424 hartree
dipole: 8.4380 0.8985 0.0007
dipole: 8.4857
quadrupole: -61.2848 -59.7969 -68.1056
quadrupole: -4.2965 0.0025 0.0002
quadrupole: 1.7776 3.2655 -5.0432 -4.2965 0.0025 0.0002
hfenergy: -838.7084966 hartree
pointgroup: C01 [X(C7H5Cl1N2)]
dipole: -3.3287134 0.256005 0.0002652 debye
dipolederiv: -0.252932 0.267733 0.0000215 0.279527 -0.5673252 -0.0000321 0.0000222 -0.0000335 -0.0374797 -1.7541695 -0.1035723 -0.0000053 -0.1436574 -0.1391226 0.0000218 -0.0001575 0.0000109 -0.7243101 -0.6081032 -0.0849819 0.0000644 -0.0832761 -0.242661 0.000009 0.0000075 0.0000007 -0.2537072 1.8504327 0.1182976 -0.000047 0.1112867 0.1777309 -0.0000048 -0.0000351 -0.0000065 0.1692605 -0.7376073 0.0339424 0.0000274 0.4959707 -0.1634797 -0.0000335 0.0000544 -0.0000091 -0.1822801 -0.5225874 -0.0234488 0.0000095 -0.5090565 -0.0450529 0.0000295 0.0000112 0.0000093 -0.2329249 -0.5788158 0.0608002 0.0000272 0.0896632 -0.313891 -0.0000112 0.0000245 -0.0000161 0.0836859 0.8116179 -0.2524744 -0.0000578 -0.1877925 0.9843874 0.0000468 -0.0000408 0.0000529 -0.0477934 0.4947142 -0.1637461 -0.0000304 -0.157984 0.1330497 0.0000033 -0.0000187 0.0000139 -0.1007131 0.737806 0.1493293 -0.0000714 0.1040843 -0.0199196 -0.0000091 -0.0000455 -0.00001 0.031336 0.0303301 -0.0618852 0.0000076 -0.0606964 -0.0120837 0.000004 0.0000045 0.0000026 0.1782085 -0.0258455 0.1004276 0.0000127 0.0851355 -0.0240852 -0.0000092 0.0000101 -0.0000133 0.1764633 0.0700882 -0.0555804 0.0000057 -0.0439555 -0.0298332 0.0000003 0.000005 0.0000035 0.1589771 0.2486959 -0.005034 0.0000183 -0.0606549 0.1262198 -0.0000173 0.0000858 -0.0000263 0.390576 0.2363757 0.0201931 0.0000176 0.0814061 0.1360662 0.0000026 0.0000724 0.000021 0.3907011 unknown
polarizability: 161.8901712|-2.1810468|100.3241063|-0.0047844|0.001711|37.9132662 unknown
InChI: InChI=1S/C7H5ClN2/c8-7-3-6(10)2-1-5(7)4-9/h1-3H,10H2
charge 0 multiplicity 1
15 atoms
Cl 1.234324 -2.426567 -0.000105
N  -3.386941 -0.047401 0.000187
N  3.459695 0.669806 -0.000016
C  -2.007632 0.084147 0.000155
C  -1.17416 -1.0732 0.000085
C  -1.393009 1.374252 0.000121
C  0.849292 0.346796 -0.000007
C  0.216203 -0.927292 0.000005
C  0.001204 1.49235 0.000055
C  2.273261 0.501268 -0.0001
H  -1.61539 -2.075259 0.000098
H  -2.016802 2.274693 0.000166
H  0.469647 2.48165 0.000034
H  -3.98779 0.772148 0.000344
H  -3.827003 -0.963393 0.000277
