program: Gaussian 09
title: 000088730
version: EM64L-G09RevD.01
frameworkgroup: C1[X(C13H13NO)]
method: RPBEPBE
basis: SDD
operation: Freq
keyword: #p
keyword: freq=noraman
keyword: PBEPBE/SDD
title: #p freq=noraman PBEPBE/SDD
converged: YES YES NO NO
title: Mulliken charges:
elementType: O N C C C C C C C C C C C C C H H H H H H H H H H H H H
charge: -0.345055 -0.681370 0.341833 0.214200 0.439395 0.273724 -0.388961 -0.348411 -0.362201 -0.374816 -0.331169 -0.377421 -0.807235 -0.256690 -0.218136 0.252650 0.268733 0.230918 0.229735 0.258575 0.217477 0.224085 0.223446 0.234445 0.225436 0.220246 0.302035 0.334535
chargesum: 0.00000
title: Mulliken charges with hydrogens summed into heavy atoms:
elementType: O N C C C C C C C C C C C C C
charge: -0.345055 -0.044800 0.341833 0.214200 0.439395 0.273724 -0.136311 -0.079678 -0.131284 -0.145082 -0.072594 -0.159944 -0.125259 -0.031255 0.002110
polarizability: 2.22134167e+02 -4.73030989e+00 1.42999517e+02 1.13344498e+01 -2.53134002e+00 9.46108229e+01
1716.lowfreq: -26.2666 -0.0004 0.0003 0.0004 0.7093 6.1880 8.6440 24.1876 44.1237
frequency: -25.6518 24.1562 44.1105 70.8621 133.8333 173.5468 230.8696 257.5726 293.6050 319.0569 348.1652 368.1146 413.2663 417.0692 434.6910 482.7677 491.8017 525.2992 527.4731 558.9252 599.0415 636.9430 693.1160 705.0357 732.3261 744.0931 776.3952 816.0825 822.0228 830.2311 836.8101 864.3646 920.3621 944.1823 956.4608 966.2325 985.0666 1002.7075 1005.4741 1040.8180 1046.3709 1116.1446 1120.8634 1155.6596 1168.6568 1178.2249 1205.3878 1224.1030 1276.2932 1300.8556 1325.9067 1368.5429 1397.7080 1399.3482 1410.2510 1449.4315 1472.4557 1474.0227 1494.6255 1504.4520 1587.1607 1592.0845 1603.0441 1620.7222 1633.9242 2972.5463 3053.0220 3081.8462 3121.3690 3123.7017 3126.9171 3138.6262 3148.9790 3161.9317 3165.0959 3169.3678 3564.4566 3712.6668
redmass: 1.0282 4.4791 3.9701 4.3118 4.1563 4.2760 4.6602 3.6795 3.7207 3.6700 1.2813 3.4693 2.9637 3.5580 3.0629 1.3071 1.9775 4.5210 5.1912 4.6797 5.9772 6.8588 4.6413 3.3663 4.4708 1.2650 4.8916 4.8188 1.5084 1.3241 1.3796 5.9850 1.3587 1.3010 1.2910 1.3501 1.4004 1.8854 2.7048 1.8176 1.5349 1.2980 1.6269 1.9267 1.0686 1.5525 2.1957 4.3229 1.6142 1.2904 2.0604 5.5308 1.2257 7.2214 3.4219 2.6470 1.0522 1.0964 2.6447 3.3035 6.6552 5.4659 1.5288 6.4562 3.3279 1.0387 1.0950 1.0996 1.0864 1.0896 1.0892 1.0885 1.0938 1.0945 1.0956 1.1002 1.0443 1.1044
irintensity: 0.4281 1.3091 0.3277 0.6507 0.8385 0.1668 3.2809 10.9962 28.3318 9.0971 180.6687 8.5296 0.3453 2.5696 11.4461 85.1870 17.2687 3.0403 0.7081 0.5914 0.6086 0.4196 0.6485 3.0414 0.5029 110.3048 7.1742 5.7993 57.1731 6.9059 3.6399 29.9352 3.5917 1.4512 0.2113 0.0467 0.2346 3.4820 7.8476 11.2226 19.2901 25.7407 61.8148 12.1592 1.6894 121.3760 282.6755 60.9116 2.5049 0.5602 36.8256 0.5763 6.7383 22.9419 1.0282 10.5164 12.3654 10.3110 222.0437 122.5449 6.2441 7.0261 39.9766 32.5112 221.7005 47.6232 24.6167 18.7890 11.9983 17.5000 24.0668 7.6670 33.4920 8.8319 1.4838 16.6939 66.6553 36.1527
temp: 298.150 k
press: 1.00000 atm
elementType: 8 7 6 6 6 6 6 6 6 6 6 6 6 6 6 1 1 1 1 1 1 1 1 1 1 1 1 1
symmnumber: 1
zpe: 590116.2 jmol-1
zpe.correction: 0.224763 hartree
zpe.thermalcorrener: 0.237602 hartree
zpe.thermalcorrenthalpy: 0.238546 hartree
zpe.thermalcorrgfe: 0.184515 hartree
zpe.sumelectzpe: -632.093554 hartree
zpe.sumelectthermal: -632.080716 hartree
zpe.sumelectthermalent: -632.079771 hartree
zpe.sumelectthermalfe: -632.133803 hartree
dipole: -0.4882 0.6967 1.0429
dipole: 1.3459
quadrupole: -74.3085 -79.1860 -89.9635
quadrupole: 4.5508 5.3144 1.1469
quadrupole: 6.8442 1.9667 -8.8109 4.5508 5.3144 1.1469
hfenergy: -632.3183177 hartree
pointgroup: C01 [X(C13H13N1O1)]
dipole: -0.198751 0.3725751 0.3194861 debye
polarizability: 222.2459915|0.2901014|137.9510777|12.0650987|-14.7205603|99.5474373 unknown
InChI: InChI=1S/C13H13NO/c1-10-6-8-11(9-7-10)15-13-5-3-2-4-12(13)14/h2-9H,14H2,1H3
charge 0 multiplicity 1
28 atoms
O  0.344911 0.801385 -0.704479
N  2.432245 2.287491 0.171375
C  -0.954623 0.372478 -0.32687
C  1.503414 0.0845 -0.277337
C  -3.642557 -0.273056 0.346732
C  2.594604 0.906839 0.135565
C  -2.009223 0.794279 -1.16551
C  -1.222936 -0.362745 0.850069
C  -3.339442 0.473409 -0.822038
C  -2.561791 -0.67628 1.17243
C  1.617437 -1.314227 -0.354316
C  3.810886 0.260147 0.493245
C  -5.074947 -0.646854 0.689188
C  2.832574 -1.940926 0.010681
C  3.923139 -1.145357 0.434831
H  -1.774332 1.367436 -2.067677
H  -0.405256 -0.675463 1.50641
H  -4.154611 0.806013 -1.476129
H  -2.766919 -1.242021 2.089566
H  0.763806 -1.90739 -0.698881
H  4.664465 0.867838 0.817404
H  -5.219292 -0.742166 1.780051
H  -5.790373 0.107639 0.316684
H  -5.356074 -1.617357 0.235342
H  2.924126 -3.030117 -0.044503
H  4.869311 -1.620084 0.717752
H  3.193963 2.897686 0.448415
H  1.548597 2.686803 -0.1335
