program: Gaussian 09
title: 000088712
version: EM64L-G09RevD.01
frameworkgroup: C1[X(C9H9ClO2)]
method: RPBEPBE
basis: SDD
operation: Freq
keyword: #p
keyword: freq=noraman
keyword: PBEPBE/SDD
title: #p freq=noraman PBEPBE/SDD
converged: NO NO NO NO
title: Mulliken charges:
elementType: Cl O O C C C C C C C C C H H H H H H H H H
charge: -0.066673 -0.440410 -0.250382 0.480669 -0.511313 -0.385243 -0.385073 0.249414 -0.580829 -0.348273 -0.323942 0.116019 0.239197 0.238909 0.242639 0.241357 0.274282 0.274857 0.272915 0.275825 0.386054
chargesum: 0.00000
title: Mulliken charges with hydrogens summed into heavy atoms:
elementType: Cl O O C C C C C C C C C
charge: -0.066673 -0.054356 -0.250382 0.480669 -0.033206 -0.142604 -0.143716 0.249414 -0.031690 -0.075358 -0.048117 0.116019
polarizability: 1.85301588e+02 -1.18322488e+00 1.03674945e+02 1.14801343e+01 -6.24476032e-01 5.71531241e+01
1716.lowfreq: 0.0014 0.0014 0.0020 1.5739 6.7023 22.4678 38.1928 51.3252 73.6389
frequency: 37.7606 51.3053 73.5200 79.3660 148.8316 184.3081 213.2286 304.3206 340.1565 374.8137 406.7580 486.0752 499.9036 572.6974 599.1814 632.3542 662.8829 690.5784 716.9852 769.0999 786.4052 817.8410 865.0144 873.2011 982.1125 988.9500 998.5911 1004.2138 1025.0535 1038.0148 1101.1556 1136.3424 1150.7884 1195.2438 1213.1174 1257.7376 1267.9396 1311.1940 1320.9591 1322.2249 1386.6465 1411.3192 1458.6818 1481.3772 1499.5963 1574.6327 1619.7862 1638.2351 3013.2265 3053.2896 3073.7330 3125.2868 3127.8998 3137.4038 3160.8431 3174.9803 3520.4955
redmass: 5.2481 8.5110 4.6130 3.0456 5.8718 5.1897 10.5309 4.8620 2.8250 6.8112 2.8598 5.4155 3.2623 4.9622 1.2675 6.9381 5.5390 3.7702 3.6268 4.7280 1.1335 4.2003 1.2681 1.7719 1.5110 1.3711 1.3773 4.2376 2.8979 4.3170 1.2521 1.1494 1.7089 1.1730 2.6242 1.2423 1.2166 1.3633 1.3875 2.3340 5.8060 3.1171 1.0869 1.1151 2.5386 7.2221 6.3185 8.5603 1.0596 1.0565 1.1039 1.0900 1.0902 1.1116 1.0954 1.0950 1.0642
irintensity: 0.7220 0.5381 1.8314 1.9858 1.3586 1.2724 3.3326 1.4730 0.1216 19.1181 0.3311 12.6564 41.5690 15.6460 81.6693 0.7201 77.4874 67.8626 42.1039 7.6722 2.5446 4.0911 1.9092 34.5892 17.9945 2.1464 0.7518 154.4766 131.0168 10.7650 1.9501 7.0139 125.9785 3.4165 0.1553 7.5495 1.3012 17.6099 5.6631 118.4869 3.3512 18.2554 2.3608 10.6072 9.6462 19.2921 46.9797 301.0607 12.1845 19.3319 5.5912 9.3345 9.5645 15.5325 3.9681 1.4258 49.3572
temp: 298.150 k
press: 1.00000 atm
elementType: 17 8 8 6 6 6 6 6 6 6 6 6 1 1 1 1 1 1 1 1 1
symmnumber: 1
zpe: 418439.7 jmol-1
zpe.correction: 0.159375 hartree
zpe.thermalcorrener: 0.170726 hartree
zpe.thermalcorrenthalpy: 0.171670 hartree
zpe.thermalcorrgfe: 0.120051 hartree
zpe.sumelectzpe: -958.008280 hartree
zpe.sumelectthermal: -957.996930 hartree
zpe.sumelectthermalent: -957.995986 hartree
zpe.sumelectthermalfe: -958.047605 hartree
dipole: -0.6639 -1.3431 0.1656
dipole: 1.5074
quadrupole: -90.9991 -73.8791 -78.2194
quadrupole: 8.6991 1.7488 0.8707
quadrupole: -9.9666 7.1534 2.8131 8.6991 1.7488 0.8707
hfenergy: -958.1676557 hartree
pointgroup: C01 [X(C9H9Cl1O2)]
dipole: -0.2542876 -0.5309756 0.0714379 debye
dipolederiv: -0.8574858 0.0003538 0.0737889 -0.0013222 -0.1736288 -0.0001341 0.0316218 -0.0004755 -0.2060335 -0.7482899 -0.4518535 -0.0272314 -0.6317906 -0.9730089 -0.0729486 -0.0405002 -0.0600906 -0.4294753 -1.0340972 0.2830372 -0.089335 0.2454936 -0.8077211 0.0343801 -0.1081665 0.0486381 -0.3465044 0.4389571 -0.0011112 0.0158055 0.0080284 0.0834313 -0.0005817 0.1609638 -0.0016699 -0.071036 -0.2621716 0.0002777 0.0713573 -0.0005351 0.115583 -0.0012324 0.1123436 -0.0020972 0.0326278 -0.2714785 0.1573096 0.0104882 0.181337 0.0311511 0.0290168 0.0002865 0.0257177 -0.1582094 -0.2920112 -0.1507572 0.0112354 -0.1916862 0.0320735 -0.0346108 0.0020083 -0.028506 -0.1588875 -0.7914315 -0.0159305 -0.0837454 -0.0015262 -0.065083 0.0008783 -0.1180656 -0.001301 -0.0178308 1.0094364 0.0009818 -0.0358095 0.0004097 0.1898317 0.000193 -0.2052521 0.0010965 0.19236 0.1537432 -0.10891 0.0326699 0.1313567 0.0290375 0.0188251 0.0276285 -0.0165733 -0.0901812 0.1794652 0.1081843 0.0341706 -0.1162419 0.0214988 -0.0192341 0.035308 0.0132395 -0.0901661 2.0875905 0.0844967 0.228725 0.2236714 1.3880085 0.0144736 0.2774161 -0.0027735 0.2676231 0.0242638 -0.0147523 -0.0279538 -0.0490386 -0.0416547 -0.0977852 -0.0210749 -0.0609432 0.0250022 0.024389 0.0148286 -0.0282442 0.0487312 -0.0389037 0.0993238 -0.0217451 0.0626149 0.0216276 0.0245711 -0.0962426 -0.02501 -0.0929827 -0.0353929 -0.0102612 -0.0214075 -0.013295 0.1399103 0.0234691 0.0961367 -0.0271311 0.094397 -0.0370467 0.0145266 -0.0236651 0.0172494 0.1381278 -0.0365352 -0.0515127 -0.0410894 -0.0224478 -0.0256787 -0.0969904 -0.0129394 -0.0561353 0.0241267 -0.0366528 0.0502672 -0.0427443 0.0220295 -0.0214291 0.0973643 -0.0139775 0.05681 0.0212933 0.0817487 0.0719414 -0.0089685 0.0443886 0.0196732 0.0065781 -0.0146002 0.0110035 0.153521 0.087377 -0.0570139 -0.0075147 -0.0587003 0.014139 -0.0053124 -0.0132533 -0.0056568 0.1563275 0.1951426 0.0802689 -0.0334634 0.1664287 0.2951199 0.023531 -0.032929 0.0131478 0.3957766 unknown
polarizability: 185.7247454|-0.3171734|103.6566046|8.9203368|-0.6041836|56.7483068 unknown
InChI: InChI=1S/C9H9ClO2/c10-6-5-7-1-3-8(4-2-7)9(11)12/h1-4,11H,5-6H2
charge 0 multiplicity 1
21 atoms
Cl 5.320742 0.009537 -0.500574
O  -3.630662 -1.226069 -0.283115
O  -3.743959 1.093217 -0.330165
C  1.231011 0.011494 0.444727
C  2.741748 0.014391 0.63852
C  0.51402 1.231897 0.318383
C  0.515463 -1.211717 0.345759
C  -1.580573 0.003422 0.008173
C  3.446258 0.001903 -0.73128
C  -0.876877 1.232758 0.103416
C  -0.876526 -1.222397 0.130788
C  -3.050884 0.051909 -0.213038
H  3.063406 0.911956 1.196556
H  3.064906 -0.871678 1.213753
H  1.052247 2.184293 0.399394
H  1.05558 -2.161028 0.448145
H  3.221116 -0.907775 -1.308684
H  3.216068 0.897784 -1.327931
H  -1.440242 2.167213 0.010676
H  -1.430314 -2.162861 0.060069
H  -4.610026 -1.124348 -0.429773
