program: Gaussian 09
title: 000088691
version: EM64L-G09RevD.01
frameworkgroup: C1[X(C7H6BrNO2)]
method: RPBEPBE
basis: SDD
operation: Freq
keyword: #p
keyword: freq=noraman
keyword: PBEPBE/SDD
title: #p freq=noraman PBEPBE/SDD
converged: YES YES NO YES
title: Mulliken charges:
elementType: Br O O N C C C C C C C H H H H H H
charge: 0.015072 -0.439124 -0.316553 -0.681075 0.104403 0.352116 -0.292409 -0.341851 -0.232578 -0.172426 0.148082 0.277767 0.247479 0.255471 0.378962 0.310654 0.386011
chargesum: 0.00000
title: Mulliken charges with hydrogens summed into heavy atoms:
elementType: Br O O N C C C C C C C
charge: 0.015072 -0.053113 -0.316553 0.008540 0.104403 0.352116 -0.014642 -0.094372 0.022893 -0.172426 0.148082
polarizability: 1.80568250e+02 -1.82988975e+00 1.12213816e+02 -5.16539810e-03 -7.82523616e-04 3.97468101e+01
1716.lowfreq: -5.3270 -4.1431 -0.0009 -0.0007 -0.0005 8.3008 72.9553 98.1649 157.4259
frequency: 72.9499 98.1640 157.4257 196.2302 229.9210 255.1364 277.5823 378.6961 432.6683 449.8859 480.4170 503.4984 561.3952 566.7244 587.5498 634.6747 674.2453 719.0924 727.5318 773.2833 814.8813 853.9497 874.0815 972.4152 1003.8933 1041.9020 1088.1658 1138.5948 1169.2677 1282.7670 1292.3987 1336.9051 1395.6567 1436.9340 1480.6656 1542.3488 1572.2929 1623.7655 1639.1903 3154.5627 3168.7316 3189.6832 3400.6073 3536.2311 3646.9756
redmass: 7.7470 9.3322 8.7056 5.0097 12.7691 4.7105 5.9455 4.7197 2.8400 8.8578 1.1389 4.0226 6.4462 1.3161 3.7794 5.3211 3.8468 5.0439 1.4954 1.6968 1.6429 1.6083 6.8658 1.3432 5.5247 2.0244 1.6666 1.4001 1.5284 1.2884 2.4628 3.4090 6.1924 4.1147 3.1353 3.4209 5.7563 2.4785 2.7068 1.0924 1.0884 1.0975 1.0565 1.0641 1.0944
irintensity: 0.0268 0.4979 0.1338 1.1707 1.7544 8.1864 0.3215 20.0587 40.9526 19.7721 107.1899 9.4290 3.6199 108.5830 8.8962 17.2858 59.2730 10.9833 46.8037 142.1864 11.8877 31.9137 72.0975 0.8044 332.8223 65.0873 5.9939 96.8197 74.8628 2.9753 21.9311 135.4906 22.9590 22.2786 38.0527 189.7567 166.2243 380.5773 251.7588 3.7756 0.3857 1.1221 134.3371 62.8955 55.0941
temp: 298.150 k
press: 1.00000 atm
elementType: 35 8 8 7 6 6 6 6 6 6 6 1 1 1 1 1 1
symmnumber: 1
zpe: 313624.6 jmol-1
zpe.correction: 0.119453 hartree
zpe.thermalcorrener: 0.129313 hartree
zpe.thermalcorrenthalpy: 0.130257 hartree
zpe.thermalcorrgfe: 0.083092 hartree
zpe.sumelectzpe: -488.241693 hartree
zpe.sumelectthermal: -488.231833 hartree
zpe.sumelectthermalent: -488.230889 hartree
zpe.sumelectthermalfe: -488.278054 hartree
dipole: -0.9801 0.8661 0.0059
dipole: 1.3080
quadrupole: -73.0097 -60.9942 -76.6729
quadrupole: 4.0345 -0.0189 0.0103
quadrupole: -2.7841 9.2314 -6.4473 4.0345 -0.0189 0.0103
hfenergy: -488.3611459 hartree
pointgroup: C01 [X(C7H6Br1N1O2)]
dipole: -0.3824463 -0.3432991 -0.0264671 debye
dipolederiv: -0.8317009 -0.0100528 -0.0220332 0.0489853 -0.0697884 0.000047 -0.0198728 -0.0014995 -0.0384735 -0.7084148 0.4846059 0.011885 0.7596657 -1.0701438 -0.0049123 0.0227418 -0.0122675 -0.4263096 -1.1715636 -0.203307 -0.030211 -0.3478715 -0.7542565 -0.0251873 -0.0361545 -0.0215287 -0.3617914 -0.5418743 -0.5487358 -0.0186418 -0.397505 -1.1182541 -0.0289582 -0.0126878 -0.0326364 -0.6550238 -1.1435888 0.3309915 -0.0160522 -0.2987239 -0.3329101 -0.0187048 -0.0414092 -0.0015178 -0.0710096 0.6044869 0.7378163 0.0416038 0.2216333 1.0653536 0.0423783 0.0213767 0.05695 0.1619266 0.6744304 -0.1449422 0.0144932 0.5376284 0.0244718 0.0185466 0.0416973 0.0001025 -0.0718013 -0.6078383 -0.6088601 -0.0361914 -0.0381492 -0.2372767 -0.0035406 -0.013308 -0.0190224 -0.1755492 -0.9266098 0.3061949 -0.0083094 0.2238624 -0.2338341 0.0036501 -0.0116397 0.0055633 -0.1748059 1.5054772 0.0420559 0.0448777 -0.3110849 0.5789632 0.017886 0.0310485 0.0275552 -0.079263 2.2684384 -0.3431945 0.041683 -0.2962682 1.332346 0.0355805 0.0439293 0.0342201 0.2399537 0.0801911 0.0546929 0.0001069 0.0303032 0.0258434 -0.0044647 -0.0007017 -0.0038252 0.1569984 0.0604441 0.0304575 -0.0018166 0.058661 -0.045634 -0.0071941 -0.0006799 -0.0080546 0.173569 0.0458634 -0.0667319 -0.006231 -0.0599357 -0.000237 -0.0087452 -0.0059562 -0.0088192 0.178306 0.3382186 -0.0276388 -0.0022058 -0.0103265 0.2818933 -0.0040192 -0.0017124 -0.0048219 0.3720593 0.1415052 0.0558351 -0.0040997 0.0609293 0.2356533 -0.0040444 -0.0039848 -0.0047029 0.3718486 0.2125351 -0.0891869 -0.0088576 -0.1818038 0.3178102 -0.0083177 -0.0126866 -0.005695 0.3993657 unknown
polarizability: 180.4271538|2.2662958|112.1295872|3.9229275|2.9592777|39.9721349 unknown
InChI: InChI=1S/C7H6BrNO2/c8-4-1-2-5(7(10)11)6(9)3-4/h1-3,10H,9H2
charge 0 multiplicity 1
17 atoms
Br 4.083601 0.064945 0.082042
O  -2.677119 1.568709 -0.041873
O  -2.939121 -0.728904 -0.140733
N  -0.718464 -2.243192 -0.141067
C  -0.689477 0.2165 -0.041358
C  -0.015343 -1.061693 -0.073778
C  0.079221 1.41246 0.027287
C  1.416438 -1.077085 -0.035893
C  1.48089 1.392868 0.064584
C  2.121761 0.127529 0.031027
C  -2.153213 0.268686 -0.079131
H  -0.454629 2.366312 0.051171
H  1.947015 -2.033952 -0.059885
H  2.061254 2.316471 0.116957
H  -1.744447 -2.191717 -0.168377
H  -0.231301 -3.13532 -0.164684
H  -3.668866 1.504783 -0.072388
