program: Gaussian 09
title: 000088692
version: EM64L-G09RevD.01
frameworkgroup: C1[X(C12H22O2)]
method: RPBEPBE
basis: SDD
operation: Freq
keyword: #pfreq=noraman
keyword: PBEPBE/SDD
title: #p freq=noraman PBEPBE/SDD
converged: YES YES NO NO
title: Mulliken charges:
elementType: O O C C C C C C C C C C C C H H H H H H H H H H H H H H H H H H H H H H
charge: -0.286878 -0.256251 -0.028668 -0.077877 -0.486914 -0.009056 -0.494333 -0.432626 -0.041819 -0.747166 -0.737292 -0.751141 0.296631 -0.763472 0.183641 0.267036 0.219488 0.206848 0.192801 0.208075 0.230792 0.195475 0.195944 0.220330 0.208115 0.241972 0.208838 0.204111 0.212189 0.222666 0.206406 0.210376 0.244689 0.245299 0.246293 0.245479
chargesum: 0.00000
title: Mulliken charges with hydrogens summed into heavy atoms:
elementType: O O C C C C C C C C C C C C
charge: -0.286878 -0.256251 0.154973 0.189159 -0.060578 0.183745 -0.055467 -0.041207 0.178511 -0.088242 -0.098327 -0.089671 0.296631 -0.026401
polarizability: 1.38892677e+02 3.05861380e+00 1.38308178e+02 5.83467495e-01 -1.04639024e+00 1.18469992e+02
1716.lowfreq: -33.2412 -13.4960 -5.4676 0.0004 0.0004 0.0005 8.1872 26.8229 53.2441
frequency: -32.7130 26.6124 53.0227 63.2335 80.7418 104.0238 167.7997 186.5213 198.7975 211.1049 228.2063 237.2553 254.8131 290.3218 341.0226 355.8086 369.4655 378.2780 424.8953 427.6741 460.9523 496.6819 566.3082 577.4620 607.4262 679.0850 756.4107 781.6978 796.6133 856.8266 882.4112 888.4336 907.1708 915.6478 942.1068 954.7991 958.3726 974.2300 995.6267 1009.0949 1010.6791 1039.3512 1075.6148 1084.7982 1095.5423 1121.4848 1132.7458 1149.0766 1172.9307 1186.4537 1205.6865 1218.3342 1245.9083 1266.7370 1287.8802 1297.3598 1312.7284 1320.4609 1326.9146 1331.5637 1347.1790 1348.0984 1354.8738 1372.9343 1380.7058 1381.3033 1392.5719 1399.1317 1451.0785 1452.6996 1454.6426 1460.2799 1466.3828 1471.7023 1475.3049 1479.5819 1484.1612 1490.1175 1497.6625 1640.4722 2923.8715 2952.4357 2963.6351 2967.3472 2970.4325 2972.1642 2981.3519 2982.5978 2989.9039 3004.7393 3022.8341 3035.5866 3042.4879 3049.5088 3056.2772 3059.5639 3065.0214 3073.3806 3079.8212 3087.9656 3092.6778 3140.8135
redmass: 1.0976 6.8372 2.4740 2.9600 2.7893 3.1982 3.3317 2.6533 1.8223 1.1799 1.3195 2.9947 1.3230 2.9669 2.3222 2.4048 1.9699 2.1555 3.0074 2.5081 2.3996 2.6469 3.1168 4.7283 3.5679 2.7050 2.9538 2.5626 2.1320 2.7140 2.3739 2.2930 2.6215 1.2408 1.7911 1.9374 1.6144 1.7083 1.8114 1.7938 1.7176 1.6634 1.7486 2.1138 1.5205 1.8463 1.3610 2.0510 1.7802 1.8957 2.3906 1.8323 1.2857 1.2492 1.4294 1.4727 1.6176 1.3803 1.5690 1.5211 1.3688 1.3742 1.3763 1.4238 1.2532 1.2165 1.2264 1.2053 1.0817 1.0667 1.0478 1.0724 1.0687 1.0718 1.0573 1.0449 1.0548 1.0551 1.0474 8.9398 1.0808 1.0701 1.0655 1.0370 1.0403 1.0433 1.0683 1.0779 1.0645 1.0368 1.0969 1.0977 1.0860 1.1014 1.0985 1.0989 1.0977 1.0988 1.0979 1.0986 1.0973 1.1008
irintensity: 1.1437 1.4472 0.0343 0.5660 1.8799 0.4527 2.8073 2.1502 0.9535 2.1622 0.5625 2.3261 0.1716 2.8815 0.7085 1.0553 0.2212 0.1737 4.9364 0.2773 0.5049 0.2662 3.0378 3.6772 2.2863 7.0734 5.2779 7.5850 1.3014 1.7427 17.4913 2.8900 24.5941 13.2444 14.1909 23.3331 11.0611 0.1162 74.2317 7.0803 6.9528 7.7272 4.6188 1.3178 6.2079 10.5805 9.7091 31.6072 10.7333 38.4896 220.6903 75.3408 1.6070 1.1710 0.2681 0.2036 1.4619 0.5934 1.2302 4.0916 1.0240 0.8299 1.1220 6.9257 54.7017 22.5381 17.9058 19.9200 21.5061 15.2793 16.5706 3.5428 8.6635 1.5925 13.0534 8.2914 5.8602 11.5712 25.9364 174.9318 14.6288 14.3606 35.3558 25.4976 28.3926 47.8054 67.6401 31.6263 15.9132 3.2969 51.9307 26.5485 10.0206 66.3765 1.5240 45.9065 90.1037 37.4783 43.9321 35.8213 10.5144 11.6211
temp: 298.150 k
press: 1.00000 atm
elementType: 8 8 6 6 6 6 6 6 6 6 6 6 6 6 1 1 1 1 1 1 1 1 1 1 1 1 1 1 1 1 1 1 1 1 1 1
symmnumber: 1
zpe: 835020.4 jmol-1
zpe.correction: 0.318042 hartree
zpe.thermalcorrener: 0.333493 hartree
zpe.thermalcorrenthalpy: 0.334437 hartree
zpe.thermalcorrgfe: 0.275288 hartree
zpe.sumelectzpe: -619.799775 hartree
zpe.sumelectthermal: -619.784324 hartree
zpe.sumelectthermalent: -619.783380 hartree
zpe.sumelectthermalfe: -619.842530 hartree
dipole: 0.9064 1.3088 -1.3968
dipole: 2.1179
quadrupole: -87.7150 -89.0537 -87.9138
quadrupole: -2.1420 5.7275 7.2038
quadrupole: 0.5125 -0.8262 0.3137 -2.1420 5.7275 7.2038
hfenergy: -620.1178171 hartree
pointgroup: C01 [X(C12H22O2)]
dipole: -0.3851051 0.4990067 0.5449684 debye
polarizability: 139.0399353|-3.0688892|138.1036634|1.0147653|1.1657876|118.5272484 unknown
InChI: InChI=1S/C12H22O2/c1-8(2)11-6-5-9(3)7-12(11)14-10(4)13/h8-9,11-12H,5-7H2,1-4H3
charge 0 multiplicity 1
36 atoms
O  0.792961 -0.709668 0.405492
O  2.009018 -2.09849 -1.026689
C  -1.34391 0.265757 -0.299497
C  0.083397 -0.089533 -0.775394
C  -1.294531 1.461052 0.689683
C  0.885128 2.364555 -0.361558
C  0.883858 1.122812 -1.29325
C  -0.569035 2.685151 0.079715
C  -2.119753 -0.969777 0.260374
C  1.843198 2.220629 0.847092
C  -3.591832 -0.615557 0.58906
C  -2.088071 -2.174702 -0.713882
C  1.739975 -1.697174 0.130145
C  2.371596 -2.193689 1.414505
H  -1.880561 0.60562 -1.216052
H  0.062396 -0.859463 -1.567004
H  -0.78589 1.137751 1.618921
H  -2.320647 1.758149 0.972858
H  1.251618 3.221085 -0.965796
H  0.423084 1.405987 -2.262809
H  1.91752 0.800033 -1.52143
H  -1.145805 3.034854 -0.802361
H  -0.561234 3.520323 0.8076
H  -1.616495 -1.274335 1.200872
H  1.871678 3.159194 1.432614
H  1.533627 1.401258 1.517619
H  2.873996 2.003751 0.507901
H  -4.118791 -0.249827 -0.314413
H  -4.131841 -1.509665 0.95214
H  -3.674738 0.160719 1.369597
H  -2.504147 -1.895343 -1.702085
H  -2.701624 -3.004639 -0.316984
H  -1.067975 -2.566604 -0.872864
H  1.593525 -2.557834 2.107335
H  2.899694 -1.365475 1.919336
H  3.08151 -3.002805 1.19051
