program: Gaussian 09
title: 000088677
version: EM64L-G09RevD.01
frameworkgroup: C1[X(C9H6BrNS)]
method: RPBEPBE
basis: SDD
operation: Freq
keyword: #p
keyword: freq=noraman
keyword: PBEPBE/SDD
title: #p freq=noraman PBEPBE/SDD
converged: NO YES NO NO
title: Mulliken charges:
elementType: Br S N C C C C C C C C C H H H H H H
charge: 0.035550 0.044749 -0.106953 0.467547 0.191332 -0.311831 -0.417343 -0.311539 -0.228610 -0.209640 -0.179037 -0.359820 0.243469 0.251083 0.253268 0.236295 0.251132 0.150347
chargesum: 0.00000
title: Mulliken charges with hydrogens summed into heavy atoms:
elementType: Br S N C C C C C C C C C
charge: 0.035550 0.195096 -0.106953 0.467547 0.191332 -0.311831 -0.173874 -0.060456 -0.228610 0.043628 0.057258 -0.108688
polarizability: 2.21210534e+02 1.75317059e+00 1.52577924e+02 -3.47558069e-03 8.03741272e-04 4.82083470e+01
1716.lowfreq: -8.7172 -6.8699 -0.0022 -0.0017 -0.0015 2.2100 70.8222 124.7955 140.6527
frequency: 70.8212 124.7954 140.6494 183.3603 217.7957 253.5861 266.1637 409.4779 422.4583 460.8765 503.9410 538.5093 547.4826 582.0923 583.4650 655.8280 656.9687 777.7329 793.2872 796.6201 829.3809 843.5644 863.2804 943.0477 957.7631 974.1393 988.9742 1040.4531 1114.1039 1136.4011 1171.0479 1220.9643 1238.1332 1315.0636 1356.1627 1402.5297 1412.9986 1422.4309 1479.5084 1543.8141 1577.7437 1598.6816 2086.5550 3136.2280 3141.5579 3142.6036 3173.8081 3176.2579
redmass: 8.2092 5.9267 15.0070 5.3469 4.3110 15.6862 5.6705 11.3674 3.5998 4.6583 3.6030 7.5119 2.6888 7.0882 1.2330 4.5610 7.4419 1.2774 1.8342 2.9943 6.3684 1.8024 2.6285 1.3920 1.3579 5.4850 1.3841 2.4751 2.1730 1.6103 1.5278 1.9292 1.8592 3.6011 3.2454 1.8836 5.6837 2.8132 3.7342 8.0236 6.1576 6.6807 1.0372 1.0884 1.0908 1.0905 1.0963 1.0989
irintensity: 0.3771 1.4008 7.2668 17.8030 5.3843 1.0567 1.5615 0.1137 2.3071 15.2722 0.3193 0.2471 12.2911 3.1304 12.5939 9.3356 11.1873 0.6640 31.3239 36.9930 2.7475 69.1635 148.7666 0.2744 0.2608 44.3609 1.2952 1.0924 28.2500 0.6127 5.5584 6.1865 2.8799 23.7803 56.2513 3.3613 33.0322 39.9740 61.2673 13.7029 13.2921 13.4912 129.1024 3.3552 5.0911 14.9564 8.0134 24.1288
temp: 298.150 k
press: 1.00000 atm
elementType: 35 16 7 6 6 6 6 6 6 6 6 6 1 1 1 1 1 1
symmnumber: 1
zpe: 318643.9 jmol-1
zpe.correction: 0.121365 hartree
zpe.thermalcorrener: 0.131254 hartree
zpe.thermalcorrenthalpy: 0.132198 hartree
zpe.thermalcorrgfe: 0.084667 hartree
zpe.sumelectzpe: -812.003655 hartree
zpe.sumelectthermal: -811.993766 hartree
zpe.sumelectthermalent: -811.992822 hartree
zpe.sumelectthermalfe: -812.040353 hartree
dipole: -4.3579 -2.7450 0.0009
dipole: 5.1504
quadrupole: -71.3714 -78.9567 -91.0068
quadrupole: -0.4627 -0.0013 0.0005
quadrupole: 9.0736 1.4882 -10.5618 -0.4627 -0.0013 0.0005
hfenergy: -812.1250199 hartree
pointgroup: C01 [X(C9H6Br1N1S1)]
dipole: -1.6788668 1.1345747 -0.007919 debye
dipolederiv: -0.7365309 0.0115089 -0.0013821 0.0854747 -0.0178856 0.0001893 -0.0014075 0.00001 -0.013105 -0.0750269 0.1710325 -0.0005258 0.1278607 -0.6015491 0.0021489 -0.0004092 0.0022477 -0.114751 -0.6011938 0.0175483 -0.0008199 0.1398578 -0.3792504 0.0010224 -0.0013664 0.0007806 -0.1910067 -0.1381341 0.0419946 -0.0006294 0.4638961 -0.0480193 0.0014764 -0.0022707 0.0007089 0.1064326 0.3498573 0.3578134 -0.0008666 -0.2910994 -0.2339875 0.0005874 0.0018613 0.0018228 0.05369 -0.5682955 -0.2004942 -0.00013 -0.227487 0.9752131 -0.0045497 0.0001399 -0.0043543 -0.0732187 -0.143064 0.0405738 -0.0000369 0.0473589 -0.0108644 -0.000759 -0.0000818 -0.0008711 -0.2072084 0.2482999 0.0220224 0.0006207 -0.0530676 0.2115681 -0.0014684 0.0010521 -0.0013643 -0.1261165 1.3449891 -0.1829111 0.0034109 -0.0989876 -0.3986694 0.0009204 0.0026521 0.0007778 -0.1150824 -0.2332918 0.0088954 -0.00036 -0.0370336 0.2481067 -0.001358 -0.0000656 -0.0013061 -0.0747709 -0.041739 -0.0676758 0.0004595 -0.2177108 -0.2602115 0.0001262 0.0009711 0.00042 -0.1282609 0.1837282 0.0113926 0.0003859 0.221499 0.3752699 -0.0013235 -0.000442 -0.0017608 -0.0565314 0.0263186 0.0818643 -0.0006036 0.0222798 -0.0673878 0.0010298 -0.0003545 0.0012031 0.1713321 0.0755262 0.0168582 -0.0001997 0.0855855 -0.068635 0.0010313 -0.0004907 0.0009189 0.1468127 0.0256279 -0.0889942 0.0001325 -0.0683962 0.0212867 0.0004336 -0.0000257 0.0004203 0.1582554 -0.1124782 0.0317426 -0.0006584 0.0406966 0.0947178 0.0003728 -0.0007087 0.0003649 0.1686942 -0.0282486 -0.0767076 0.0000096 -0.1142789 -0.0143724 0.0004018 0.0001565 0.000482 0.1380254 0.4236555 -0.1964643 0.0011934 -0.126448 0.1746698 -0.0002818 0.0007898 -0.0005005 0.1568094 unknown
polarizability: 221.0260438|-3.9561481|152.7601167|0.3345882|-0.4227499|48.2106441 unknown
InChI: InChI=1S/C9H6BrNS/c10-7-4-3-6-2-1-5-11-8(6)9(7)12/h1-5,12H
charge 0 multiplicity 1
18 atoms
Br 3.912445 -0.088946 0.008785
S  1.509846 -2.511367 0.014001
N  -1.24652 -1.460564 0.004865
C  -0.756864 0.964561 -0.003895
C  -0.337671 -0.416349 0.002461
C  1.070721 -0.760845 0.006421
C  0.234679 1.995916 -0.006206
C  -2.166045 1.221672 -0.007538
C  1.995141 0.291858 0.003778
C  1.589281 1.660273 -0.002499
C  -3.069818 0.156524 -0.004968
C  -2.561972 -1.180422 0.001306
H  -0.073287 3.046909 -0.011139
H  -2.520247 2.258799 -0.01241
H  2.357025 2.438871 -0.004353
H  -4.150644 0.323287 -0.007698
H  -3.24583 -2.036106 0.003534
H  0.11456 -2.79457 0.012054
