program: Gaussian 09
title: 000088671
version: EM64L-G09RevD.01
frameworkgroup: C1[X(C9H12N2O)]
method: RPBEPBE
basis: SDD
operation: Freq
keyword: #p
keyword: freq=noraman
keyword: PBEPBE/SDD
title: #p freq=noraman PBEPBE/SDD
converged: YES YES NO NO
title: Mulliken charges:
elementType: O N N C C C C C C C C C H H H H H H H H H H H H
charge: -0.253091 -0.370754 -0.388062 0.454906 -0.487631 0.254619 -0.415096 -0.348148 -0.659153 -0.197650 -0.205937 -0.265161 0.238855 0.205113 0.307349 0.315289 0.222364 0.234267 0.215379 0.253746 0.219040 0.222813 0.220436 0.226507
chargesum: 0.00000
title: Mulliken charges with hydrogens summed into heavy atoms:
elementType: O N N C C C C C C C C C
charge: -0.253091 -0.063405 -0.072773 0.454906 -0.043664 0.254619 -0.192731 -0.113881 0.029012 0.025163 0.014499 -0.038655
polarizability: 1.55538908e+02 -3.17945514e+00 1.08430951e+02 -1.26202299e+01 -6.24200291e+00 7.70271668e+01
1716.lowfreq: -7.8614 -0.0007 -0.0007 0.0002 2.9377 8.6846 26.1479 41.7196 46.1050
frequency: 25.8793 41.6251 46.1011 83.4522 179.3930 199.8686 230.6766 237.4873 298.9189 321.7712 405.9638 444.0971 473.8867 514.7621 531.2304 586.2281 613.4184 656.7693 691.6747 692.5870 756.7614 795.4039 820.8870 828.6551 885.3214 900.9850 959.0112 979.2562 981.8168 1007.6384 1022.0029 1050.9658 1076.3464 1083.3111 1138.9422 1169.8172 1180.8570 1213.9626 1258.1662 1298.9114 1313.8012 1335.8737 1384.4246 1391.1096 1430.4110 1444.8199 1451.8634 1472.8874 1485.1644 1487.6786 1502.7235 1600.7793 1616.2945 1632.5674 2982.6921 2995.6328 3036.4090 3091.8201 3106.4206 3118.0038 3127.7430 3141.0536 3154.6636 3168.3559 3494.6950 3520.7706
redmass: 3.6497 3.8858 5.2503 2.3988 3.5406 1.3241 2.9841 2.5770 3.1124 4.1930 2.8872 2.1388 2.9454 2.7974 1.5572 2.7100 6.2209 4.0859 3.2809 1.9316 1.7319 1.2951 1.6599 2.2813 1.4865 3.9375 1.3681 1.3020 5.9224 2.7290 2.1389 1.7102 1.8694 1.5494 2.9003 1.0500 1.1089 2.0746 1.3679 2.4477 1.4097 1.6857 4.6041 1.1957 2.0372 1.7431 1.1206 1.0444 2.4365 1.0636 1.4369 5.2941 6.3450 6.4071 1.0587 1.0361 1.1011 1.1008 1.1005 1.0866 1.0864 1.0929 1.0942 1.1010 1.0762 1.0788
irintensity: 0.7819 1.1316 6.4593 2.9379 1.0652 3.2318 1.7593 14.8781 6.0357 6.2523 0.4380 60.6816 23.1014 52.7750 84.2786 62.4542 2.3817 28.9749 4.5994 33.5973 88.4987 6.6303 0.9152 7.0252 7.7337 9.8439 0.2705 0.6311 0.6394 9.9283 7.9276 23.1572 5.1902 5.2537 48.7577 1.2736 8.9771 63.5689 28.6287 8.3873 5.2024 10.6034 21.7173 18.6760 50.8752 86.0054 19.2692 14.2365 97.9734 11.3887 25.4303 17.1109 151.2847 105.3432 27.5285 28.1531 15.9646 39.9965 20.9271 10.5872 1.2194 25.5484 34.5448 14.7257 19.3348 33.1002
temp: 298.150 k
press: 1.00000 atm
elementType: 8 7 7 6 6 6 6 6 6 6 6 6 1 1 1 1 1 1 1 1 1 1 1 1
symmnumber: 1
zpe: 515431.8 jmol-1
zpe.correction: 0.196318 hartree
zpe.thermalcorrener: 0.208288 hartree
zpe.thermalcorrenthalpy: 0.209232 hartree
zpe.thermalcorrgfe: 0.156431 hartree
zpe.sumelectzpe: -533.974530 hartree
zpe.sumelectthermal: -533.962560 hartree
zpe.sumelectthermalent: -533.961616 hartree
zpe.sumelectthermalfe: -534.014417 hartree
dipole: 1.1687 0.5800 -2.9318
dipole: 3.2090
quadrupole: -63.8254 -65.6301 -75.8673
quadrupole: 3.0785 -9.7398 0.1259
quadrupole: 4.6155 2.8109 -7.4264 3.0785 -9.7398 0.1259
hfenergy: -534.170848 hartree
pointgroup: C01 [X(C9H12N2O1)]
dipole: 0.4223441 -0.3185343 1.1463688 debye
dipolederiv: -0.6358489 0.0891408 -0.0525177 -0.0810674 -0.5009204 0.2611197 0.3773987 0.2154327 -0.8076833 -0.7161485 -0.1721008 -0.0777984 -0.5133026 -0.2540185 -0.2341495 -0.3856718 -0.4127287 -0.4979883 -0.5791094 -0.1988399 0.2911378 -0.404922 -0.3459528 -0.0901623 0.6579458 0.0602261 -0.2956967 1.0681902 0.4612519 0.287845 0.7748172 0.2634729 0.2113607 0.3066017 0.2186199 0.2389013 -0.270665 0.1656687 -0.0431091 0.0873545 0.0520492 -0.0218386 -0.0353006 -0.0048176 0.0270573 1.3291139 -0.1381177 -0.2900212 0.0758628 0.3811362 -0.2783711 -0.775412 -0.3825031 1.0182329 -0.4314779 -0.2030154 -0.0309533 0.0450933 0.0712805 0.029671 -0.0799587 -0.1013051 -0.2198357 -0.1975623 -0.0348093 0.0121534 -0.4198146 -0.1747506 -0.1230663 0.0355708 0.0071018 -0.2011712 0.0629822 0.0061019 0.0291436 0.0089812 0.0484613 -0.0018115 -0.0572938 0.0131241 -0.0046222 0.1283352 0.058294 0.1025711 -0.0070896 0.1775879 -0.0303536 0.1065663 0.0092193 -0.0855804 0.1591107 -0.0558589 0.1125478 0.0754054 0.1602182 0.0015249 0.1184766 -0.0287755 -0.0848425 -0.1437602 0.0893672 0.0415082 0.0581847 -0.1928429 0.0316296 0.0266105 0.0297027 -0.1993447 -0.0416014 -0.0693892 -0.0456006 -0.0588052 -0.0456251 -0.065081 -0.0364504 -0.0374702 0.0658408 0.0442539 -0.0161538 0.0876682 0.0228321 0.0117567 0.1028172 0.0494574 0.0858084 -0.1222839 0.0379037 -0.0379919 -0.0414383 0.0816801 0.2123838 0.0680483 0.0127272 0.1762353 0.2554774 0.1340994 0.0486238 -0.0288893 0.2098763 0.2474204 0.0589383 -0.0134762 0.0755948 0.1399959 0.0978644 -0.0445829 -0.0278669 -0.017924 -0.1194879 0.0035888 -0.0291823 0.0013966 0.1499572 -0.0117375 0.0875272 -0.0817785 0.1058015 0.0498722 0.0162037 -0.0757383 0.0271363 0.1269875 -0.1550062 0.1099718 -0.0485292 0.1150268 0.0533629 -0.0002184 -0.0614008 0.0119915 0.067582 0.1298333 -0.0100623 0.0123046 -0.0465661 0.039314 0.0981028 0.0547302 0.0569345 -0.0422732 0.0172984 -0.132919 -0.0271759 -0.0876172 -0.0621439 -0.0650815 0.0020895 -0.0505481 0.0654942 -0.0562493 0.0866761 -0.0785458 0.0947842 0.0289751 0.0440583 -0.0866002 0.0419523 0.1204263 0.0904798 -0.0000285 -0.0212438 -0.0265033 -0.1350862 0.011173 -0.0252759 0.0139361 0.1418884 -0.0602988 -0.0887538 -0.0814115 -0.0920879 0.033537 -0.0281025 -0.0864135 -0.0262642 0.1434809 unknown
polarizability: 154.2926566|3.1923993|109.394413|15.9851416|-2.9889606|77.3099561 unknown
InChI: InChI=1S/C9H12N2O/c1-2-9(12)11-10-8-6-4-3-5-7-8/h3-7,10-11H,2H2,1H3
charge 0 multiplicity 1
24 atoms
O  2.165263 1.088716 -0.94947
N  0.028875 1.162568 0.856279
N  1.24026 0.495386 1.09815
C  -1.093506 0.427655 0.376909
C  3.571327 -0.169765 0.644752
C  2.285715 0.512114 0.169556
C  -2.219384 1.151534 -0.101738
C  -1.143132 -0.989029 0.428683
C  4.198257 -1.027734 -0.477064
C  -3.372977 0.462182 -0.5251
C  -2.307603 -1.666154 0.004591
C  -3.429741 -0.951623 -0.472879
H  4.284187 0.626674 0.936319
H  3.382806 -0.781928 1.548086
H  0.168964 2.089642 0.441084
H  1.38566 0.146245 2.048178
H  -2.187073 2.247459 -0.141134
H  -0.272768 -1.552715 0.778895
H  5.181883 -1.419945 -0.164281
H  4.330931 -0.416534 -1.385333
H  3.549355 -1.882922 -0.736173
H  -4.231665 1.032099 -0.897903
H  -2.332948 -2.761355 0.043665
H  -4.328583 -1.48327 -0.801771
