program: Gaussian 09
title: 000088667
version: EM64L-G09RevD.01
frameworkgroup: C1[X(C7H12O2)]
method: RPBEPBE
basis: SDD
operation: Freq
keyword: #pfreq=noraman
keyword: PBEPBE/SDD
title: #p freq=noraman PBEPBE/SDD
converged: YES YES NO NO
title: Mulliken charges:
elementType: O O C C C C C C C H H H H H H H H H H H H
charge: -0.269234 -0.250517 -0.462179 -0.482413 0.568415 0.292742 -0.658167 -0.796409 -0.721656 0.231054 0.244612 0.241874 0.244149 0.228886 0.214764 0.229434 0.234787 0.233659 0.228001 0.223103 0.225095
chargesum: 0.00000
title: Mulliken charges with hydrogens summed into heavy atoms:
elementType: O O C C C C C C C
charge: -0.269234 -0.250517 0.013487 0.003611 0.568415 0.292742 0.014917 -0.099963 -0.273458
polarizability: 1.14034866e+02 -9.80073796e+00 7.10698189e+01 -4.76811098e+00 2.21418425e+00 6.46830203e+01
1716.lowfreq: -37.8621 -15.0347 -7.1204 -5.6171 0.0003 0.0005 0.0009 31.3379 50.8603
frequency: -35.3386 30.6563 50.7481 76.9431 163.6620 184.9038 198.0645 252.7006 291.2632 358.4805 399.1499 449.6164 532.6688 569.6004 619.8618 697.7853 789.9603 799.7952 822.5016 897.3635 952.2081 967.6172 983.1108 1013.7223 1034.3719 1070.9693 1076.3476 1084.8474 1124.0965 1233.3889 1241.5063 1304.3042 1329.0254 1351.2923 1394.8881 1396.9500 1431.2351 1442.6621 1452.7921 1465.1872 1471.3888 1479.0470 1480.5158 1646.8111 1672.6681 2975.4185 2997.6315 3000.4338 3005.9588 3045.2464 3052.0683 3091.5583 3094.1280 3096.7880 3098.6952 3102.5313 3195.5686
redmass: 2.0070 5.4714 2.7263 2.9791 1.1931 1.2704 2.1396 3.6799 5.0830 3.1107 2.1588 2.2144 2.6153 2.9604 4.2432 1.1907 1.3540 3.6009 3.2229 5.2260 1.3261 1.3416 1.7746 1.7980 1.5109 1.7739 2.9939 1.6185 3.0021 1.1598 1.1727 2.7522 1.4991 1.4915 1.2381 1.2129 1.1714 1.0853 1.0727 1.0791 1.0396 1.0680 1.0511 8.8786 5.0434 1.0370 1.0480 1.0488 1.0605 1.0987 1.0967 1.0659 1.0967 1.1003 1.1030 1.1003 1.1141
irintensity: 0.1055 1.3178 0.7504 3.3549 1.5120 0.1690 2.1600 4.1666 10.8338 11.3480 4.0996 2.5574 1.9970 5.5387 1.5725 0.8296 15.3826 10.1179 3.3552 54.9402 74.5083 2.7671 16.8679 62.1611 3.9916 5.8163 103.2860 0.0675 264.7693 5.1783 0.6535 1.3424 28.5978 22.7110 23.0346 17.8060 4.8116 28.6776 5.8422 32.1596 11.6058 21.8462 17.0984 156.3193 22.7710 18.1468 38.0773 5.8099 23.3050 4.2162 19.0229 12.8406 25.7467 28.9883 9.0004 33.6380 21.0838
temp: 298.150 k
press: 1.00000 atm
elementType: 8 8 6 6 6 6 6 6 6 1 1 1 1 1 1 1 1 1 1 1 1
symmnumber: 1
zpe: 460817.7 jmol-1
zpe.correction: 0.175516 hartree
zpe.thermalcorrener: 0.185791 hartree
zpe.thermalcorrenthalpy: 0.186735 hartree
zpe.thermalcorrgfe: 0.138715 hartree
zpe.sumelectzpe: -423.656199 hartree
zpe.sumelectthermal: -423.645924 hartree
zpe.sumelectthermalent: -423.644980 hartree
zpe.sumelectthermalfe: -423.693000 hartree
dipole: 0.3563 -0.4410 -1.3314
dipole: 1.4471
quadrupole: -49.8526 -53.1003 -59.0376
quadrupole: 1.3570 3.9307 -3.3647
quadrupole: 4.1442 0.8965 -5.0408 1.3570 3.9307 -3.3647
hfenergy: -423.8317154 hartree
pointgroup: C01 [X(C7H12O2)]
dipole: 0.1464535 -0.261725 0.4839398 debye
dipolederiv: -1.5974695 -0.1988333 -0.3110695 -0.3108419 -0.3915283 -0.0185012 -0.3043983 -0.0228819 -0.5380504 -0.7054685 -0.1138312 -0.003828 -0.0153459 -0.3917112 0.2282292 -0.3557161 0.1291073 -0.8583154 0.7675994 0.067398 0.0390248 0.2375212 0.2728947 0.0065397 -0.3158663 -0.0385431 0.1713246 -0.1104381 -0.106888 0.0530779 -0.1759271 0.0282677 0.0923676 0.1361724 0.1381301 -0.0633421 0.1597492 -0.0206214 0.1106408 -0.0492942 0.106635 0.1659701 0.1382727 0.1845074 0.1035795 1.604751 0.3620854 0.2512147 0.3041657 0.3813526 -0.2593645 0.7259677 -0.1737725 1.1200328 -0.0066201 -0.0094322 -0.0491081 -0.027484 0.0681306 -0.0083948 -0.0145 -0.0020184 0.0320922 -0.0273849 -0.0354779 -0.0505838 0.0196084 -0.079368 -0.098393 -0.0547381 -0.1049564 -0.0332083 -0.2357674 -0.1473909 -0.0182139 -0.0901053 -0.135568 0.1854832 0.0514435 0.1768152 -0.2759915 -0.019564 -0.05686 -0.0252703 -0.0450882 -0.0256789 -0.089648 0.0167361 -0.1379721 0.0016224 0.0192433 0.0510401 -0.0501009 -0.0139656 0.0666952 0.0235194 0.0870129 0.1020724 -0.0048173 -0.0040001 0.07187 -0.0394892 0.056605 -0.0416006 0.0694431 -0.0574775 0.0320521 0.093806 0.0417634 -0.0267495 0.01657 0.0020491 0.050082 -0.1106404 -0.005095 -0.0906593 -0.0421994 0.0780357 0.045849 0.0516308 0.0305056 0.0360879 -0.0967555 -0.0035344 -0.1146957 -0.0664958 -0.086706 -0.1009729 0.0664689 -0.1232868 0.0327733 0.0615593 0.101206 0.0754975 0.0259167 0.058964 0.0542989 -0.0301865 0.1100723 -0.0893836 0.0522869 -0.0620032 0.0378781 0.0750751 0.1011072 0.0302406 -0.083312 0.001683 0.0455269 0.0718352 -0.0915565 0.025331 -0.0742014 -0.0115089 -0.1259667 0.0500583 -0.1352723 0.0102508 -0.0017201 0.0493956 0.0463518 0.0460512 -0.0889298 0.1391356 0.0501709 0.0900261 0.0164554 -0.0485555 0.0018522 -0.0325191 0.0921966 0.0959366 0.0220006 -0.023819 -0.0077135 -0.0052747 -0.1592172 -0.0387604 -0.1463666 0.0657446 -0.0332925 0.0991058 -0.003876 0.1420882 0.0449612 -0.0660436 -0.0044131 -0.0833577 0.1291802 unknown
polarizability: 112.2994053|7.1216307|66.2348563|11.7378444|4.1165374|71.2534434 unknown
InChI: InChI=1S/C7H12O2/c1-4-7(8)9-5-6(2)3/h2,4-5H2,1,3H3
charge 0 multiplicity 1
21 atoms
O  -0.085153 0.295579 0.819274
O  -1.220841 0.579113 -1.20762
C  1.112169 1.024392 0.278302
C  -2.299316 -0.604306 0.686487
C  2.263882 0.063618 0.064965
C  -1.188775 0.146404 -0.033517
C  -3.555932 -0.790827 -0.18141
C  2.012565 -1.082762 -0.893926
C  3.453636 0.270969 0.688324
H  1.350764 1.785516 1.038006
H  0.806919 1.505734 -0.670549
H  -1.888679 -1.578646 1.014639
H  -2.53082 -0.052844 1.617649
H  -3.322322 -1.351197 -1.10273
H  -4.329583 -1.344562 0.379219
H  -3.974876 0.183118 -0.48683
H  1.651537 -0.71036 -1.871644
H  1.226444 -1.754845 -0.499771
H  2.923973 -1.68162 -1.05746
H  3.600391 1.100843 1.390149
H  4.316118 -0.380817 0.509544
