program: Gaussian 09
title: 000088613
version: EM64L-G09RevD.01
frameworkgroup: C1[X(C5H8N2O2)]
method: RPBEPBE
basis: SDD
operation: Freq
keyword: #pfreq=noraman
keyword: PBEPBE/SDD
title: #p freq=noraman PBEPBE/SDD
converged: NO YES NO NO
title: Mulliken charges:
elementType: O O N N C C C C C H H H H H H H H
charge: -0.196576 -0.214273 -0.458713 -0.658654 0.352532 0.169378 -0.823795 0.291667 -0.629036 0.227948 0.251774 0.227839 0.314416 0.226337 0.264135 0.304884 0.350138
chargesum: 0.00000
title: Mulliken charges with hydrogens summed into heavy atoms:
elementType: O O N N C C C C C
charge: -0.196576 -0.214273 -0.144297 -0.003632 0.352532 0.169378 -0.116234 0.291667 -0.138564
polarizability: 1.06956949e+02 -9.51743459e+00 8.38352301e+01 -5.10874877e-03 4.20002004e-03 3.72435145e+01
1716.lowfreq: -44.3805 -1.7112 0.0007 0.0008 0.0009 9.6236 12.2606 48.9534 108.6232
frequency: -44.2520 48.8572 108.6185 145.3637 229.6025 266.3155 309.4614 357.3650 383.1604 389.4638 438.7086 532.2266 541.4898 613.2727 614.6723 642.3475 726.0111 794.5848 871.8278 896.3379 955.8747 998.3627 999.1355 1047.1713 1048.9037 1149.5871 1264.1419 1297.9366 1389.3748 1413.6931 1442.3177 1480.8095 1483.8172 1611.9882 1618.0155 1659.9699 1700.4107 2955.8982 3029.2426 3087.6361 3102.8078 3215.3568 3527.2874 3536.2239 3687.6812
redmass: 4.4713 3.8295 3.6538 4.5077 1.0360 5.7190 1.2468 3.1149 3.4743 4.8854 3.7128 1.1446 3.4367 3.9382 1.1675 1.5535 6.7930 2.2466 5.1421 3.4550 2.1819 1.3111 1.3728 1.5078 2.0374 3.0118 2.7424 4.1499 1.1786 1.2334 1.9722 1.0452 1.1035 1.5343 2.6714 4.9126 6.4728 1.0392 1.0983 1.0954 1.0619 1.1155 1.0605 1.0608 1.1040
irintensity: 7.5425 3.4001 0.0027 3.9100 1.4331 0.3217 48.6727 2.5784 0.1477 4.7811 2.8705 280.0637 16.5400 4.9634 71.4201 8.3455 36.6278 26.4288 12.0154 0.5080 17.8810 59.5377 14.7797 4.9141 15.0856 199.5343 140.9266 85.1649 21.1984 16.6934 742.5254 17.5319 13.0213 55.7112 60.9386 21.3363 328.0852 24.5651 23.1249 21.3388 7.5722 3.6556 27.4143 26.0560 34.9476
temp: 298.150 k
press: 1.00000 atm
elementType: 8 8 7 7 6 6 6 6 6 1 1 1 1 1 1 1 1
symmnumber: 1
zpe: 344604.2 jmol-1
zpe.correction: 0.131253 hartree
zpe.thermalcorrener: 0.140356 hartree
zpe.thermalcorrenthalpy: 0.141300 hartree
zpe.thermalcorrgfe: 0.096951 hartree
zpe.sumelectzpe: -454.596584 hartree
zpe.sumelectthermal: -454.587481 hartree
zpe.sumelectthermalent: -454.586537 hartree
zpe.sumelectthermalfe: -454.630886 hartree
dipole: 1.2685 7.6638 -0.0011
dipole: 7.7680
quadrupole: -43.5337 -54.3323 -55.3935
quadrupole: -9.0862 0.0044 -0.0024
quadrupole: 7.5528 -3.2458 -4.3070 -9.0862 0.0044 -0.0024
hfenergy: -454.7278368 hartree
pointgroup: C01 [X(C5H8N2O2)]
dipole: -0.5578759 -3.0048313 -0.0004275 debye
dipolederiv: -0.6035522 -0.0432025 -0.0001427 0.0995018 -0.8786192 -0.0005721 -0.0001461 0.0004666 -0.3185531 -0.7807362 -0.1881295 0.0000202 -0.2316971 -0.8594249 -0.0003124 0.000317 0.0001283 -0.350372 -2.022002 0.4245802 0.0002421 0.1998348 -0.5217394 0.0001052 0.0002734 -0.0000731 -0.3687115 -0.8310523 0.5058397 -0.0001634 0.5260384 -0.8206514 -0.0001527 0.0001199 -0.0003557 -0.7843619 -0.4233043 -0.0078876 -0.0000625 -0.0058741 0.2404329 -0.0000814 -0.0004861 -0.0000903 -0.0920291 1.7856423 -0.2855836 0.0002905 -0.4828618 1.0811119 0.0006502 0.0006306 -0.0002509 0.2605984 -0.0933163 -0.0481083 -0.000104 -0.0398802 -0.1433559 0.0000361 -0.0003356 -0.0000076 0.1070528 2.2979135 -0.3487538 -0.0006779 0.0685977 1.4965977 0.0005628 -0.0011373 0.0005212 0.3621081 0.0065915 0.09916 0.0003157 -0.0730367 -0.0827728 -0.000012 0.0000886 0.0000469 -0.3213785 0.0636391 0.0730761 -0.1117808 0.0589652 0.0084134 0.0472638 -0.1025402 0.0769945 -0.0438181 -0.1275552 -0.1178283 -0.0001635 -0.0181317 0.0663363 -0.000007 -0.0001727 -0.0000604 0.1223923 0.0631506 0.0732936 0.1119665 0.0590742 0.0083833 -0.0471932 0.1027889 -0.0768964 -0.0435065 0.2024168 0.0339508 0.0001066 0.0049121 0.0709762 -0.0000315 0.0002762 -0.0001324 0.2993776 -0.0658459 -0.0602734 -0.0001469 -0.0990536 0.0638813 -0.0000816 -0.0000495 -0.0000234 0.1691276 0.1379904 -0.0317564 -0.0000554 -0.0040851 -0.0105326 0.0000226 -0.0000822 -0.0000116 0.1952815 0.18124 -0.0536489 0.0001942 -0.0564952 0.1074711 -0.0001123 0.0002344 -0.0001648 0.4045734 0.2087804 -0.024728 0.0001615 -0.0058088 0.1734922 -0.0000845 0.0002208 -0.000091 0.4022189 unknown
polarizability: 106.5764083|-9.9617021|84.215771|0.0050257|-0.004299|37.2435145 unknown
InChI: InChI=1S/C5H8N2O2/c1-3(2)4(8)7-5(6)9/h7H,1,6H2,2H3
charge 0 multiplicity 1
17 atoms
O  -0.380196 1.718213 0.000398
O  2.440651 1.047553 0.000009
N  0.573315 -0.438578 0.000926
N  2.772585 -1.254351 -0.000674
C  -1.875804 -0.214829 0.000387
C  -0.51573 0.469057 0.001434
C  -1.985109 -1.731824 0.0005
C  1.966699 -0.111657 0.000438
C  -2.967713 0.595285 -0.000635
H  -1.518109 -2.182473 0.899607
H  -3.043529 -2.040957 -0.000307
H  -1.516675 -2.182725 -0.897735
H  0.33013 -1.431123 0.000766
H  -3.986423 0.192633 -0.00136
H  -2.838931 1.683215 -0.000677
H  2.427874 -2.212341 -0.000859
H  3.777864 -1.095397 -0.001518
